program: Gaussian 09
title: 000272495
version: EM64L-G09RevD.01
frameworkgroup: C1[X(C13H17Cl2NO3S)]
method: RPBEPBE
basis: SDD
operation: Freq
keyword: #p
keyword: freq=noraman
keyword: PBEPBE/SDD
title: #p freq=noraman PBEPBE/SDD
converged: YES YES NO NO
title: Mulliken charges:
elementType: Cl Cl S O O O N C C C C C C C C C C C C C H H H H H H H H H H H H H H H H H
charge: 0.010146 0.014297 0.885242 -0.256875 -0.525613 -0.526510 -0.349434 0.235847 -0.290136 -0.708405 -0.698944 -0.698542 0.319870 0.006102 -0.743072 -0.226591 -0.246352 -0.044659 -0.171869 -0.089713 0.235340 0.237044 0.212871 0.222600 0.213490 0.205075 0.211888 0.235064 0.205652 0.211893 0.234648 0.276398 0.251607 0.278230 0.309751 0.292571 0.271089
chargesum: 0.00000
title: Mulliken charges with hydrogens summed into heavy atoms:
elementType: Cl Cl S O O O N C C C C C C C C C C C C C
charge: 0.010146 0.014297 0.885242 -0.256875 -0.525613 -0.526510 -0.349434 0.235847 0.182247 -0.059444 -0.046917 -0.046350 0.319870 0.006102 0.063163 0.083159 0.046219 -0.044659 0.099220 -0.089713
polarizability: 2.63723734e+02 -3.09044779e+01 1.89833741e+02 -1.27168857e+00 -3.64040776e+00 1.81996885e+02
1716.lowfreq: -5.6380 0.0015 0.0024 0.0032 1.7121 3.3441 12.6435 18.1149 23.6107
frequency: 12.2140 18.0077 23.5531 28.0214 65.2593 76.0866 91.6623 102.3008 112.7358 125.5775 149.3766 162.4780 164.6000 175.6586 194.4277 207.2433 217.0584 232.7435 239.4502 243.5565 281.8854 296.2738 321.9644 330.1918 333.2212 371.7780 380.5332 400.2873 405.9196 433.7629 438.6679 452.0406 468.4568 509.6803 544.4299 556.1488 565.5864 650.3435 651.7033 702.7631 747.1149 749.1440 805.2960 827.7486 871.9485 895.7807 907.1608 910.0999 930.8390 931.9016 934.2119 946.9547 955.3410 963.2443 994.5732 1014.9463 1026.6555 1045.6896 1055.5670 1066.3661 1115.8365 1136.4114 1178.3118 1222.7584 1237.4830 1254.5030 1276.0521 1283.9720 1354.0589 1363.5825 1374.4499 1374.4941 1376.2627 1394.7921 1405.2906 1432.8194 1452.1037 1455.4193 1456.0099 1464.3130 1465.8749 1468.5772 1481.0973 1482.1833 1498.2817 1506.9777 1564.9207 1584.7852 2970.6135 2975.9316 2980.1703 2998.2489 3000.7569 3063.4085 3064.9132 3070.8677 3073.7587 3077.3712 3086.8234 3087.0092 3091.5756 3135.8178 3164.2249 3165.9141 3181.6428
redmass: 6.7420 3.3170 5.9109 5.5700 3.1278 5.7088 5.2337 1.1042 5.2400 7.6203 5.6074 1.1307 5.8708 8.6014 7.0989 2.7358 10.7286 1.1174 9.5167 1.0860 2.8153 5.9526 2.3747 6.5321 5.6065 3.2234 5.3702 5.5110 2.2777 6.8079 3.7848 5.3921 3.2468 4.7770 6.3189 3.5227 6.0561 6.6000 6.9801 3.9808 4.6459 5.4487 13.7051 1.3425 6.1124 1.4303 1.8052 2.3939 1.6992 17.2791 1.3960 1.2108 3.0195 1.3577 8.3772 1.8080 1.4778 1.4297 1.5370 2.2291 3.4775 1.3140 1.3339 2.6140 1.2991 3.4883 3.3089 1.9500 1.5299 3.2854 5.2779 1.3469 1.2084 1.2002 1.2222 2.4001 1.0799 1.0435 1.0463 1.0731 1.1085 1.0463 1.0574 1.0622 1.0764 5.6275 6.8498 8.7867 1.0352 1.0356 1.0368 1.0562 1.0370 1.1030 1.1017 1.0995 1.1027 1.0985 1.0976 1.0996 1.0991 1.1008 1.0891 1.0930 1.0975
irintensity: 0.1955 0.3577 0.0765 0.7960 0.3728 0.6088 1.2677 2.5816 1.7838 2.3218 2.3026 0.6844 5.5109 0.2480 0.3592 5.2021 7.3924 0.6245 0.3219 0.6698 1.3141 9.2684 0.1450 4.4547 1.3586 10.8494 12.4151 8.0438 1.5950 12.8187 33.1296 133.1453 19.6136 0.3623 64.7284 3.1927 76.1465 4.2639 31.9045 2.2070 11.5746 32.0926 109.0704 23.9046 29.4603 13.5010 0.2351 11.5771 8.9744 70.2985 1.6298 0.2958 44.2274 0.1994 51.0912 89.0907 1.2882 1.8920 7.0426 30.2857 61.2593 13.9444 0.0895 31.4616 7.5413 332.8879 13.8508 7.9762 12.8238 42.3733 8.2703 17.4625 26.2908 58.9819 23.4722 88.8180 18.5436 16.5909 6.3954 12.3879 55.4076 0.0839 14.8619 33.6058 50.6654 441.2095 7.0299 8.8933 26.4515 41.4842 17.0334 9.9076 3.1711 4.9656 1.0568 13.3673 62.2876 81.4244 1.0431 2.9560 65.2006 7.6806 2.6516 10.3151 3.2114
temp: 298.150 k
press: 1.00000 atm
elementType: 17 17 16 8 8 8 7 6 6 6 6 6 6 6 6 6 6 6 6 6 1 1 1 1 1 1 1 1 1 1 1 1 1 1 1 1 1
symmnumber: 1
zpe: 724751.0 jmol-1
zpe.correction: 0.276043 hartree
zpe.thermalcorrener: 0.299384 hartree
zpe.thermalcorrenthalpy: 0.300328 hartree
zpe.thermalcorrgfe: 0.219752 hartree
zpe.sumelectzpe: -2102.476845 hartree
zpe.sumelectthermal: -2102.453504 hartree
zpe.sumelectthermalent: -2102.452560 hartree
zpe.sumelectthermalfe: -2102.533136 hartree
dipole: -3.2092 -3.5047 -1.5599
dipole: 5.0015
quadrupole: -132.8022 -152.4201 -139.3035
quadrupole: 2.1337 -5.6645 0.5919
quadrupole: 8.7064 -10.9115 2.2051 2.1337 -5.6645 0.5919
hfenergy: -2102.7528879 hartree
pointgroup: C01 [X(C13H17Cl2N1O3S1)]
dipole: 1.3453616 -1.3018942 0.6058805 debye
polarizability: 258.4800714|36.0734166|194.688469|2.4542796|5.2474751|182.3858192 unknown
InChI: InChI=1S/C13H17Cl2NO3S/c1-9(19-8-13(2,3)4)16-20(17,18)10-5-6-11(14)12(15)7-10/h5-7H,8H2,1-4H3
charge 0 multiplicity 1
37 atoms
Cl -4.300701 -1.538036 -2.344253
Cl -5.419416 -2.319334 0.641679
S  -0.651047 1.980715 -0.022485
O  3.116101 0.589583 -0.060455
O  -0.783907 2.639777 -1.509607
O  -0.66856 2.929191 1.305028
N  0.814996 0.78395 0.039321
C  4.308048 -1.55976 0.068668
C  2.92158 -0.888412 0.108112
C  4.071164 -3.083808 0.24996
C  5.195719 -1.024385 1.221905
C  4.989512 -1.29398 -1.298798
C  1.992898 1.381693 -0.087695
C  -2.021179 0.706688 0.167277
C  2.315258 2.845114 -0.265726
C  -2.551858 0.14133 -1.000282
C  -2.478753 0.407426 1.459209
C  -3.598897 -0.792088 -0.856836
C  -3.52867 -0.526867 1.583734
C  -4.079271 -1.127442 0.430617
H  2.404673 -1.053965 1.071825
H  2.26584 -1.241276 -0.7095
H  3.588843 -3.308393 1.220127
H  5.036963 -3.620209 0.221979
H  3.434273 -3.494635 -0.556231
H  4.732624 -1.221128 2.207567
H  6.183918 -1.519672 1.206505
H  5.353224 0.064116 1.12767
H  4.376823 -1.685729 -2.132961
H  5.975339 -1.792217 -1.338319
H  5.14131 -0.212908 -1.462361
H  1.905209 3.427514 0.578547
H  3.404222 2.985177 -0.32333
H  1.838133 3.226698 -1.18595
H  -2.181532 0.433723 -1.987535
H  -2.046838 0.903544 2.333196
H  -3.924139 -0.793298 2.567599
