program: Gaussian 09
title: 000272464
version: EM64L-G09RevD.01
frameworkgroup: C1[X(C13H18Cl2N2O2)]
method: RPBEPBE
basis: SDD
operation: Freq
keyword: #p
keyword: freq=noraman
keyword: PBEPBE/SDD
title: #p freq=noraman PBEPBE/SDD
converged: YES YES NO NO
title: Mulliken charges:
elementType: Cl Cl O O N N C C C C C C C C C C C C C H H H H H H H H H H H H H H H H H H
charge: -0.052685 -0.054947 -0.368762 -0.435768 -0.179996 0.056601 0.457690 -0.369042 -0.370783 -0.367507 -0.356394 0.469865 -0.588524 -0.588830 -0.431196 -0.430048 -0.292774 -0.373176 -0.320429 0.239641 0.252290 0.241736 0.250040 0.233606 0.233723 0.297162 0.262208 0.264521 0.293659 0.221017 0.310836 0.235156 0.239278 0.215658 0.237488 0.225835 0.342851
chargesum: 0.00000
title: Mulliken charges with hydrogens summed into heavy atoms:
elementType: Cl Cl O O N N C C C C C C C C C C C C C
charge: -0.052685 -0.054947 -0.368762 -0.092917 -0.179996 0.056601 0.457690 0.122889 0.120993 -0.133901 -0.122671 0.469865 -0.029154 -0.030650 -0.210179 -0.119213 -0.057619 0.081760 0.142894
polarizability: 3.55003565e+02 1.13457758e+01 2.02393712e+02 -2.11401416e+01 6.53742256e-01 1.04920013e+02
1716.lowfreq: -9.6985 -3.6134 -1.4623 -0.0025 0.0009 0.0017 19.5996 26.7655 29.3442
frequency: 19.2926 26.7435 29.3038 36.0733 48.0807 60.5683 75.3784 84.6123 107.5147 113.8916 136.5482 165.3825 197.5719 204.9020 222.0249 251.9364 258.0439 273.3577 309.3869 344.8077 351.0046 377.4707 409.6558 421.9885 429.2568 516.4309 522.8266 533.7145 579.8495 630.1418 654.2636 680.4454 686.8757 734.1974 746.5702 776.6057 780.2563 790.1271 806.6246 819.7267 838.5794 853.5815 918.9595 944.6909 949.0615 975.0123 986.3237 995.7298 997.1784 1030.2464 1036.3818 1042.9431 1044.3798 1054.5898 1104.6519 1117.6539 1136.5827 1146.7622 1178.3498 1205.7910 1219.3135 1251.8651 1256.0860 1259.1025 1266.6999 1279.6318 1293.8791 1294.8794 1326.8452 1342.3602 1347.1415 1348.6906 1367.7086 1375.2002 1388.0284 1416.5695 1439.1588 1452.8259 1454.0636 1461.7827 1477.9595 1483.1712 1492.3550 1505.0185 1545.4744 1569.2039 1623.3448 3009.9822 3010.4642 3012.8511 3019.8806 3060.3292 3063.5179 3068.8782 3075.9267 3082.9255 3107.0272 3117.3830 3145.3480 3148.6220 3149.3247 3151.7831 3159.3465 3181.4251 3569.7738
redmass: 5.3187 7.5612 7.7393 14.7923 7.2061 4.7389 2.1742 3.3877 2.8916 4.0423 3.4197 4.9729 7.3386 4.4848 4.6638 3.3311 3.5518 6.3804 1.1978 5.4254 5.0066 4.5940 4.5974 3.0944 2.9803 3.4825 4.2070 2.8498 4.0090 6.9444 6.0799 5.6034 5.4430 2.8994 3.7690 1.1283 1.4053 1.2525 1.1961 1.2886 1.6651 4.4452 6.1359 1.9538 1.8430 4.1843 1.3393 2.7695 1.5042 4.0835 2.6386 3.4122 1.5963 1.8530 3.5037 1.5239 1.4010 1.2900 1.5615 1.1443 2.0642 1.1626 1.7702 1.2275 1.3060 1.3604 1.2147 1.1902 1.3970 1.2594 1.5412 1.2434 1.7580 2.0765 1.7097 1.6563 3.3901 1.1271 1.1236 1.0914 1.0968 1.0821 1.0947 2.8161 6.6662 5.7661 6.2640 1.0603 1.0612 1.0623 1.0586 1.0573 1.0567 1.1027 1.1024 1.1028 1.1075 1.0889 1.1113 1.1096 1.0912 1.0902 1.0935 1.0951 1.0665
irintensity: 0.5683 0.5424 0.6921 0.7412 3.0430 1.2368 3.5720 0.7534 4.8515 5.6470 2.7172 7.8183 9.7747 7.2144 0.6472 2.3682 3.7362 13.5328 167.7893 16.4091 7.3628 4.1314 8.1805 0.3345 2.6006 8.0947 21.2817 8.8464 11.5873 4.0518 35.2758 77.6656 48.3798 3.7524 21.9022 4.4611 0.2516 9.5640 2.8084 8.5275 95.6782 6.9237 28.1911 21.4616 19.9273 144.7908 5.2272 0.2058 4.7156 0.0433 24.0500 5.0865 2.6318 21.4896 112.6316 38.0725 19.5267 48.3701 66.8995 35.0279 27.2150 10.3170 8.0702 14.7769 3.7698 59.8008 6.1124 2.8378 8.8953 54.7339 116.5615 0.0452 0.9497 7.0988 73.8563 39.9855 1.8918 4.8056 5.5380 19.3570 12.4387 8.8271 23.4093 227.5999 8.3073 20.8587 324.9482 10.2888 9.4562 53.7416 48.9195 11.5358 25.1208 6.4751 15.2795 1.5758 28.5254 13.9182 3.0729 37.9536 8.9263 14.5666 20.2380 10.2911 17.9997
temp: 298.150 k
press: 1.00000 atm
elementType: 17 17 8 8 7 7 6 6 6 6 6 6 6 6 6 6 6 6 6 1 1 1 1 1 1 1 1 1 1 1 1 1 1 1 1 1 1
symmnumber: 1
zpe: 774247.4 jmol-1
zpe.correction: 0.294895 hartree
zpe.thermalcorrener: 0.315404 hartree
zpe.thermalcorrenthalpy: 0.316348 hartree
zpe.thermalcorrgfe: 0.241219 hartree
zpe.sumelectzpe: -1684.733024 hartree
zpe.sumelectthermal: -1684.712515 hartree
zpe.sumelectthermalent: -1684.711571 hartree
zpe.sumelectthermalfe: -1684.786700 hartree
dipole: -0.2776 -1.7822 -0.6977
dipole: 1.9340
quadrupole: -133.9750 -141.0411 -127.6100
quadrupole: -1.9515 -12.3348 1.7176
quadrupole: 0.2337 -6.8324 6.5987 -1.9515 -12.3348 1.7176
hfenergy: -1685.0279192 hartree
pointgroup: C01 [X(C13H18Cl2N2O2)]
dipole: 0.103396 0.6462013 -0.3881672 debye
polarizability: 355.4242058|14.6528684|199.5447542|15.7442881|-16.6996504|107.3483296 unknown
InChI: InChI=1S/C13H18Cl2N2O2/c14-5-7-16(8-6-15)13-3-1-12(2-4-13)11-17(19)9-10-18/h1-4,11,18H,5-10H2
charge 0 multiplicity 1
37 atoms
Cl 4.359384 -3.755942 0.267139
Cl 5.269541 3.152142 -0.952912
O  -3.568385 -1.452067 -0.121996
O  -7.407546 0.385212 0.303975
N  2.875128 0.11545 0.575639
N  -3.727729 -0.155022 -0.425358
C  1.495205 0.250087 0.302428
C  3.450106 -1.191522 0.941625
C  3.777409 1.278278 0.507293
C  0.929586 1.513248 -0.06391
C  0.604685 -0.86536 0.389995
C  -1.339451 0.532933 -0.201902
C  3.71933 -2.069375 -0.297212
C  4.23055 1.571929 -0.937242
C  -0.444666 1.64274 -0.3023
C  -0.771949 -0.731999 0.151854
C  -2.743585 0.764119 -0.469009
C  -5.148525 0.244331 -0.692335
C  -6.003848 0.061647 0.582668
H  4.398948 -1.027034 1.481046
H  2.779517 -1.729574 1.635704
H  4.665828 1.081549 1.132131
H  3.285918 2.173902 0.928393
H  1.557565 2.403434 -0.161186
H  0.980741 -1.857995 0.654891
H  2.806159 -2.27083 -0.875314
H  4.504894 -1.655044 -0.946255
H  4.881878 0.785055 -1.345265
H  3.383587 1.761377 -1.612212
H  -0.840793 2.62881 -0.576684
H  -1.437979 -1.594243 0.229187
H  -3.065586 1.77534 -0.735194
H  -5.517703 -0.420482 -1.493988
H  -5.193633 1.291035 -1.036803
H  -5.874483 -0.969306 0.96311
H  -5.693597 0.776498 1.361905
H  -7.820002 -0.35632 -0.206406
