program: Gaussian 09
title: 000272489
version: EM64L-G09RevD.01
frameworkgroup: C1[X(C13H16N2O3)]
method: RPBEPBE
basis: SDD
operation: Freq
keyword: #p
keyword: freq=noraman
keyword: PBEPBE/SDD
title: #p freq=noraman PBEPBE/SDD
converged: YES YES NO NO
title: Mulliken charges:
elementType: O O O N N C C C C C C C C C C C C C H H H H H H H H H H H H H H H H
charge: -0.262383 -0.420303 -0.224240 -0.343007 -0.022303 -0.120330 -0.387009 -0.355153 -0.465540 0.197771 0.453990 -0.443990 -0.416400 -0.359432 -0.218663 -0.235801 -0.231628 -0.149969 0.257809 0.266164 0.197500 0.290530 0.229107 0.262858 0.234728 0.194604 0.269573 0.236678 0.235544 0.244292 0.231340 0.237258 0.236416 0.379991
chargesum: 0.00000
title: Mulliken charges with hydrogens summed into heavy atoms:
elementType: O O O N N C C C C C C C C C C C C C
charge: -0.262383 -0.040312 -0.224240 -0.052478 -0.022303 0.137478 0.076655 0.136812 -0.036208 0.197771 0.453990 0.062261 -0.180856 -0.115141 0.012676 0.001457 0.004788 -0.149969
polarizability: 1.33568239e+02 1.33203533e+01 1.81924508e+02 -2.19177223e+00 1.19162117e+01 1.42819933e+02
1716.lowfreq: -3.2144 -0.0004 0.0005 0.0007 3.7121 8.0871 10.8206 26.2800 39.3520
frequency: 8.7398 25.9683 39.3194 42.2310 51.1065 58.7295 72.4480 90.3238 117.8781 154.5899 177.1901 196.1778 253.0663 279.1705 301.1645 342.8463 356.5409 374.2270 376.8454 400.8381 427.7347 479.0974 489.5038 557.2709 576.8383 592.4379 616.2051 621.3742 695.1755 704.6087 723.7105 748.4294 785.6218 809.3194 816.4238 857.4782 862.3156 922.7326 926.1230 946.0153 976.4402 980.9214 989.3924 1002.1311 1011.5414 1025.8132 1031.1997 1042.7387 1053.1899 1078.6278 1088.6019 1123.8097 1146.0165 1175.1198 1186.2872 1194.6437 1211.5919 1225.7025 1246.2589 1263.8381 1282.4367 1286.6024 1309.6617 1323.7795 1341.0317 1345.4611 1371.8887 1382.5234 1385.7429 1440.4438 1443.5052 1446.7678 1457.6309 1474.7804 1483.0632 1498.4889 1593.2757 1611.0950 1660.9967 2198.8918 2914.1735 2937.0067 2970.6617 2988.3093 2992.9746 3052.5780 3062.5117 3074.6217 3092.3243 3116.3135 3121.0882 3136.7074 3148.9006 3166.6791 3407.4882 3496.4501
redmass: 5.5848 7.1052 8.4554 4.0194 4.5965 3.0100 3.7057 6.3756 4.2611 3.3182 4.6557 5.5169 3.9939 3.7302 6.1185 3.9269 3.5605 3.9936 3.5680 2.8173 2.7371 3.4836 5.2960 3.3635 3.8764 4.4748 6.3199 1.3399 1.7751 2.0037 2.9026 1.8654 1.2151 3.3827 3.6992 1.4047 2.8508 1.9555 2.0325 2.8598 1.9542 1.3949 5.9791 1.3401 3.8078 2.2652 3.7984 2.0602 3.0655 2.7227 1.5448 1.8967 4.5087 1.0560 1.1130 1.1773 2.5857 1.3425 1.4829 1.2567 1.1060 1.2807 1.3829 1.2629 1.3564 1.2305 1.3848 1.4991 4.3000 1.9790 1.1323 1.0864 1.1147 1.2273 2.2165 1.0791 6.0470 6.0562 8.6879 12.4342 1.0710 1.0817 1.0643 1.0644 1.0611 1.0941 1.0995 1.0948 1.0999 1.0881 1.0874 1.0903 1.0957 1.1014 1.0737 1.0638
irintensity: 0.2004 1.0764 1.3237 0.0325 1.7198 5.6594 0.3201 4.8228 2.0902 1.6060 3.9478 4.2714 3.7936 11.6264 5.5127 3.4930 2.8726 6.6413 0.5227 0.1558 2.2158 4.8954 18.6997 10.0663 30.3686 40.5507 0.1544 60.9819 214.4835 35.8501 28.1928 60.5678 2.1173 14.9047 10.0468 1.6826 3.2398 30.7022 9.3917 19.7587 4.2446 0.3192 0.4274 3.9883 130.1403 9.8079 24.9225 7.5876 61.1443 83.2125 9.5508 19.9745 38.6652 0.1741 2.5410 26.0287 17.8241 10.7033 0.8532 11.9591 6.3768 1.7582 19.9597 1.8882 15.4476 7.9926 11.4423 7.7263 1.7087 12.4024 5.4649 13.7970 16.4056 15.4034 5.3280 1.6948 0.9687 0.0129 234.9869 14.2169 45.0693 35.1152 61.6319 41.4081 9.7624 1.3533 14.9837 14.7565 11.1976 7.8383 4.3942 4.9099 31.1501 16.0270 15.2225 16.7692
temp: 298.150 k
press: 1.00000 atm
elementType: 8 8 8 7 7 6 6 6 6 6 6 6 6 6 6 6 6 6 1 1 1 1 1 1 1 1 1 1 1 1 1 1 1 1
symmnumber: 1
zpe: 711470.3 jmol-1
zpe.correction: 0.270985 hartree
zpe.thermalcorrener: 0.289241 hartree
zpe.thermalcorrenthalpy: 0.290185 hartree
zpe.thermalcorrgfe: 0.220362 hartree
zpe.sumelectzpe: -838.772362 hartree
zpe.sumelectthermal: -838.754105 hartree
zpe.sumelectthermalent: -838.753161 hartree
zpe.sumelectthermalfe: -838.822984 hartree
dipole: -3.8093 -1.3410 0.8379
dipole: 4.1245
quadrupole: -111.8913 -126.1809 -98.8857
quadrupole: -10.5950 -2.0142 -7.9819
quadrupole: 0.4280 -13.8616 13.4336 -10.5950 -2.0142 -7.9819
hfenergy: -839.0433463 hartree
pointgroup: C01 [X(C13H16N2O3)]
dipole: -1.2726954 -0.6536668 -0.765566 debye
polarizability: 129.0753879|3.5155041|141.3284662|1.1481857|-2.4213315|187.9088264 unknown
InChI: InChI=1S/C13H16N2O3/c14-7-4-8-15-12(13(16)17)10-18-9-11-5-2-1-3-6-11/h1-3,5-6,12,15-16H,4,8-10H2
charge 0 multiplicity 1
34 atoms
O  -1.03839 1.505758 -2.072588
O  2.555923 -1.690791 -1.045493
O  2.463022 -0.683034 -3.133371
N  1.28102 1.017362 -0.506168
N  2.792606 1.323479 4.157125
C  0.790984 -0.068612 -1.386967
C  -0.025455 0.556538 -2.548387
C  1.573777 0.636287 0.889708
C  -2.359038 0.91694 -1.73413
C  1.994485 -0.810508 -1.982206
C  -2.401701 0.205382 -0.391778
C  2.270491 1.831707 1.593151
C  -2.591712 -1.196875 -0.313075
C  -2.249543 0.945723 0.80976
C  -2.620596 -1.851474 0.940755
C  -2.268249 0.295373 2.062881
C  -2.45395 -1.107045 2.130761
C  2.562275 1.558778 3.009946
H  0.168773 -0.806319 -0.832785
H  0.650878 1.148857 -3.186113
H  -0.487761 -0.24193 -3.162775
H  0.620386 1.807769 -0.567588
H  0.661754 0.344784 1.460798
H  2.251633 -0.233325 0.887549
H  -3.02708 1.795901 -1.73567
H  -2.670664 0.232408 -2.550126
H  3.208068 2.067811 1.057241
H  1.629023 2.733282 1.533235
H  -2.724339 -1.777971 -1.234628
H  -2.115496 2.033258 0.755999
H  -2.770864 -2.935699 0.988518
H  -2.150026 0.875871 2.984554
H  -2.472085 -1.612016 3.102768
H  3.35935 -2.127268 -1.442295
