program: Gaussian 09
title: 000272456
version: EM64L-G09RevD.01
frameworkgroup: C1[X(C9H7N3O5)]
method: RPBEPBE
basis: SDD
operation: Freq
keyword: #pfreq=noraman
keyword: PBEPBE/SDD
title: #p freq=noraman PBEPBE/SDD
converged: NO YES NO NO
title: Mulliken charges:
elementType: O O O O O N N N C C C C C C C C C H H H H H H H
charge: -0.344435 -0.210186 -0.319721 -0.204609 -0.203681 -0.214809 0.016038 0.021110 0.392114 -0.010557 0.071514 -0.503451 -0.286270 0.420726 -0.368568 0.218807 -0.493125 0.317951 0.265975 0.290174 0.389896 0.251705 0.251811 0.251591
chargesum: 0.00000
title: Mulliken charges with hydrogens summed into heavy atoms:
elementType: O O O O O N N N C C C C C C C C C
charge: 0.045461 -0.210186 -0.319721 -0.204609 -0.203681 -0.214809 0.016038 0.021110 0.392114 -0.010557 0.071514 -0.185500 -0.020296 0.420726 -0.078394 0.218807 0.261982
polarizability: 2.77644220e+02 5.37991487e+00 1.47540637e+02 4.99105473e-03 -8.34296985e-03 5.62370346e+01
1716.lowfreq: -15.1908 -7.0441 0.0003 0.0005 0.0009 1.8400 25.9018 44.3257 55.6678
frequency: 21.8929 44.3133 55.6603 92.1270 100.2551 118.6782 168.7926 179.4214 186.8627 273.2725 276.8927 315.6342 319.6827 326.7224 368.5858 434.6898 437.0142 498.0576 562.6693 570.7833 597.6173 610.0109 636.6391 704.4811 712.3386 722.9159 731.9320 750.2650 768.8191 786.3653 834.2543 845.7215 894.4698 921.9768 960.0490 990.1837 1032.5164 1091.4351 1111.7721 1119.8438 1148.4623 1200.1081 1207.8196 1230.8085 1253.3595 1274.5973 1339.9570 1368.0290 1389.8246 1403.9198 1424.2591 1450.2425 1453.0733 1456.6546 1487.1579 1512.7463 1579.7384 1596.7344 1642.0996 2892.7664 3016.8321 3124.2605 3169.3106 3173.7684 3194.2478 3198.1397
redmass: 1.0668 5.9869 11.6619 9.2371 5.6462 5.2734 6.0391 6.9719 6.1417 5.4427 9.3316 5.8917 7.9693 8.0965 7.7719 3.0564 10.1656 9.7882 6.5091 5.8127 7.5841 6.5831 9.4043 5.5172 9.2813 10.6291 1.0996 7.6547 3.9986 8.5993 6.3002 1.5557 8.4566 1.4996 4.3972 1.3242 2.8212 5.6349 1.2579 1.4087 1.4374 3.3409 10.3248 3.4617 2.4109 3.6170 4.4020 8.4183 4.1101 2.0339 2.9428 2.2067 1.0498 1.0740 4.0252 5.9462 6.3344 3.9106 4.1110 1.0697 1.0292 1.1054 1.1057 1.0897 1.0963 1.0942
irintensity: 0.0626 0.1449 0.0848 0.0201 0.2840 9.9213 0.7029 2.4372 0.0155 5.3419 1.8749 35.1606 1.1607 1.7649 11.8009 11.0240 7.0220 4.2466 0.0391 0.0004 0.0197 3.9064 4.7350 22.5166 24.4795 0.2722 146.2915 11.8024 2.1342 5.6790 9.3496 37.7736 7.1027 37.4514 18.1494 0.9167 89.2113 29.1905 0.0166 3.2376 8.2880 296.0960 396.2437 79.4911 107.2200 73.1634 56.7217 199.8516 145.1643 63.0130 108.3344 108.0050 17.8522 7.3085 122.0623 72.5053 60.5988 3.4330 48.8622 407.9702 24.9353 17.7904 9.4198 2.7571 1.2806 10.5965
temp: 298.150 k
press: 1.00000 atm
elementType: 8 8 8 8 8 7 7 7 6 6 6 6 6 6 6 6 6 1 1 1 1 1 1 1
symmnumber: 1
zpe: 420873.4 jmol-1
zpe.correction: 0.160302 hartree
zpe.thermalcorrener: 0.174978 hartree
zpe.thermalcorrenthalpy: 0.175923 hartree
zpe.thermalcorrgfe: 0.116649 hartree
zpe.sumelectzpe: -886.183894 hartree
zpe.sumelectthermal: -886.169218 hartree
zpe.sumelectthermalent: -886.168274 hartree
zpe.sumelectthermalfe: -886.227547 hartree
dipole: 7.1911 -1.2233 -0.0010
dipole: 7.2944
quadrupole: -97.8353 -100.6416 -95.9200
quadrupole: 6.4467 0.0232 -0.0188
quadrupole: 0.2970 -2.5093 2.2123 6.4467 0.0232 -0.0188
hfenergy: -886.3441961 hartree
pointgroup: C01 [X(C9H7N3O5)]
dipole: 2.8272395 -0.4925549 -0.010608 debye
dipolederiv: -0.5450895 -0.1552508 -0.0087657 -0.2297853 -0.7036768 -0.0210008 -0.012337 -0.0204709 -0.280571 -1.6968449 0.3179896 0.0076345 0.8777703 -0.6061003 -0.0123393 0.0355885 -0.0151203 -0.2583628 -0.9887625 -0.1355024 -0.0095954 -0.1841585 -0.9221252 -0.028763 -0.0127171 -0.0304191 -0.3398986 -0.9724012 -0.1833811 -0.0117096 -0.1501902 -0.5489416 -0.0158072 -0.0099571 -0.0159339 -0.2266286 -0.6809817 0.1422113 0.0048311 0.3573888 -0.7472692 -0.0229657 0.015199 -0.0240515 -0.227255 0.4240148 0.3021252 0.0165285 0.0262033 0.3130805 0.0171227 0.0032101 0.0185258 -0.0504315 -0.2302977 -0.1963411 -0.0092804 0.1578272 -0.4118173 -0.0088117 0.0083722 -0.0104278 -0.2083732 2.1000572 -0.0756929 0.0042515 -0.434969 1.0994741 0.0411197 -0.0132801 0.0428521 0.1863631 -0.2896584 0.1435826 0.004909 0.2461794 -0.1299533 -0.0106131 0.0100987 -0.0110399 0.1141411 0.1519177 0.1438387 0.0072177 -0.1074081 0.0017038 -0.001115 -0.0045522 -0.0001158 0.0146903 -1.1743263 -0.136808 -0.0127647 -0.1802529 0.4068806 0.0149572 -0.0148249 0.0155358 0.0676771 0.5545335 -0.1434519 -0.0038798 0.1021181 -0.1110789 0.0004033 0.0075502 -0.0005266 -0.1112032 0.0292832 -0.0701239 -0.0026371 0.07996 0.1831456 0.0145061 0.0042034 0.0136794 -0.1110554 -0.9818439 0.1008622 0.0003487 -0.0424854 0.1321402 0.0034417 -0.0061918 0.0041244 0.0553605 -0.1092797 0.0996881 0.0046965 -0.0279898 -0.0652936 0.0036092 -0.0011944 0.0039973 -0.1411078 2.6382148 -0.105105 0.0065433 -0.4062831 1.2315961 0.0442188 -0.0078023 0.0467489 0.2797139 0.9372612 -0.0964931 -0.000122 -0.031674 0.2121231 -0.0030563 0.0011246 -0.0025587 0.2707366 0.126667 -0.0006697 -0.0003355 -0.0025881 0.0972224 -0.0047983 -0.0003465 -0.0048111 0.1971678 0.0830921 0.0343359 0.0013151 0.0007515 -0.0166479 -0.0084956 -0.0002853 -0.0082839 0.1612088 0.073935 -0.0696004 -0.0037304 -0.0123578 0.101861 -0.0036798 -0.0009381 -0.0038961 0.1779216 0.6229189 -0.0118687 0.0008611 -0.0000109 0.3871032 0.0004858 0.0018907 0.0002969 0.3719148 -0.0420229 0.0233376 0.0067504 -0.0724852 0.0737911 -0.0892337 -0.0392229 -0.0670451 -0.0461016 -0.0406936 0.0232159 -0.0051212 -0.0777939 0.0542207 0.1000509 0.0305032 0.078339 -0.0252895 0.0103071 0.0491017 0.0020543 0.1122337 -0.0314384 -0.0092359 0.0059088 -0.0093989 0.1293825 unknown
polarizability: 277.6799364|4.8079481|147.2907788|1.2765265|4.3644073|56.4511765 unknown
InChI: InChI=1S/C9H7N3O5/c1-17-9(13)8-10-6-3-2-5(12(15)16)4-7(6)11(8)14/h2-4,14H,1H3
charge 0 multiplicity 1
24 atoms
O  1.089351 2.220124 0.153331
O  4.105901 -0.868049 0.02065
O  3.569175 1.398511 0.130074
O  -5.095387 -0.474211 -0.000348
O  -4.311922 1.665063 0.103532
N  0.856851 0.82438 0.085699
N  1.221914 -1.435523 -0.020458
N  -4.133865 0.387052 0.043894
C  -0.405683 0.255901 0.052871
C  -0.149835 -1.168604 -0.013979
C  1.809528 -0.2115 0.040383
C  -1.696138 0.813753 0.073956
C  -1.246559 -2.0697 -0.06152
C  -2.741548 -0.124516 0.025099
C  -2.541897 -1.540778 -0.041583
C  3.22427 0.16689 0.065504
C  5.551195 -0.503652 0.04913
H  -1.896005 1.885778 0.124232
H  -1.067691 -3.146908 -0.111957
H  -3.423173 -2.185355 -0.075664
H  2.121457 2.265401 0.160603
H  5.784382 0.029979 0.984599
H  5.79341 0.137118 -0.813954
H  6.073065 -1.467459 -0.005294
