program: Gaussian 09
title: 000272438
version: EM64L-G09RevD.01
frameworkgroup: C1[X(C5H10BrNO2)]
method: RPBEPBE
basis: SDD
operation: Freq
keyword: #p
keyword: freq=noraman
keyword: PBEPBE/SDD
title: #p freq=noraman PBEPBE/SDD
converged: YES YES NO NO
title: Mulliken charges:
elementType: Br O O N C C C C C H H H H H H H H H H
charge: -0.018617 -0.189426 -0.215524 0.096469 0.296070 -0.337907 -0.696349 -0.722450 -0.717089 0.254200 0.237441 0.237696 0.211786 0.246215 0.219160 0.234169 0.258592 0.289649 0.315914
chargesum: 0.00000
title: Mulliken charges with hydrogens summed into heavy atoms:
elementType: Br O O N C C C C C
charge: -0.018617 -0.189426 -0.215524 0.096469 0.296070 0.153734 -0.000652 -0.010529 -0.111526
polarizability: 1.08561756e+02 -6.85300784e-01 6.97996906e+01 1.09747317e+00 -3.13460281e+00 7.35293571e+01
1716.lowfreq: -7.9208 -0.0008 -0.0008 -0.0006 3.6395 7.3723 25.9067 64.0839 101.9509
frequency: 25.8818 64.0381 101.9257 132.9326 169.0710 196.0773 242.0491 264.4409 282.1647 346.0399 357.4472 393.1082 509.1239 528.2058 621.6328 685.9251 758.1426 761.6244 816.2248 914.9847 942.4487 977.0895 1010.4376 1068.7341 1094.5049 1171.0972 1203.4606 1212.9421 1225.2323 1242.9521 1297.8000 1336.4130 1378.2570 1401.4111 1406.2879 1449.2987 1459.6112 1463.2630 1468.8424 1472.8861 1495.1474 3000.4722 3003.3339 3007.3570 3066.9511 3073.1076 3093.1156 3101.1460 3115.2074 3119.1835 3161.7277
redmass: 12.6169 3.8824 2.7168 3.5894 4.3312 1.0605 1.1429 3.0597 3.0596 4.0610 3.3725 2.6677 4.8525 3.1467 5.9991 5.4466 2.8396 1.9170 2.6465 1.8279 1.4035 1.5006 1.3374 3.3641 1.2382 1.8859 1.7129 5.2928 3.4454 1.5489 1.1779 1.4497 1.6390 2.2268 1.4209 1.0739 1.0933 1.0723 1.0686 1.0518 1.0518 1.0364 1.0406 1.0556 1.1002 1.0595 1.1002 1.0994 1.1003 1.0995 1.1108
irintensity: 0.3287 2.9356 2.6201 1.8464 0.5126 0.2774 0.4284 5.0439 2.0696 0.4405 6.4492 2.8174 3.6908 3.4044 30.2246 3.8155 6.1896 29.2926 1.2726 2.5366 1.9023 2.0067 0.7592 0.2213 1.8258 5.9608 11.9024 64.7408 25.0446 22.7040 1.6355 13.4611 132.8859 59.6301 21.8986 0.5250 2.5363 9.1741 9.3136 9.8536 29.9342 9.3435 8.1437 15.8168 4.4729 9.9733 8.9741 26.0132 14.4178 12.9203 5.3866
temp: 298.150 k
press: 1.00000 atm
elementType: 35 8 8 7 6 6 6 6 6 1 1 1 1 1 1 1 1 1 1
symmnumber: 1
zpe: 392918.0 jmol-1
zpe.correction: 0.149655 hartree
zpe.thermalcorrener: 0.160532 hartree
zpe.thermalcorrenthalpy: 0.161476 hartree
zpe.thermalcorrgfe: 0.111119 hartree
zpe.sumelectzpe: -414.380719 hartree
zpe.sumelectthermal: -414.369842 hartree
zpe.sumelectthermalent: -414.368898 hartree
zpe.sumelectthermalfe: -414.419255 hartree
dipole: -1.0239 3.8051 1.1004
dipole: 4.0912
quadrupole: -72.5445 -66.9541 -64.0268
quadrupole: -8.6146 -2.8058 0.1598
quadrupole: -4.7027 0.8877 3.8150 -8.6146 -2.8058 0.1598
hfenergy: -414.5303739 hartree
pointgroup: C01 [X(C5H10Br1N1O2)]
dipole: -0.3150033 1.5737113 0.1227054 debye
dipolederiv: -0.5976613 0.0797436 -0.000532 0.0353554 -0.1465218 0.005919 0.0950937 -0.0114939 -0.150672 -0.3958527 -0.0898714 -0.2766269 -0.2608484 -0.4705107 -0.1295051 -0.3186344 0.0494395 -0.5884589 -0.3727746 -0.0921943 -0.1137574 -0.0002588 -0.5519924 0.2805715 -0.2205994 0.0824265 -0.6401377 0.4064345 0.2666376 0.4227131 0.4332218 0.7430339 -0.1596247 0.5706935 -0.1466239 0.9024527 0.1787804 -0.1218803 -0.0353201 -0.077965 0.2568462 0.0093348 -0.1182647 0.0132029 0.2099667 -0.0391893 0.0919858 -0.0252573 -0.0425287 -0.0467004 0.0245811 0.1136682 -0.0025395 -0.0028898 -0.0811888 0.0560421 -0.0544261 -0.0033479 -0.019907 0.0418698 -0.0160416 0.0262395 -0.0538009 0.0071824 0.0012648 0.0029812 -0.0296307 -0.030497 0.0008639 0.0211888 0.0228404 -0.1098163 0.7655259 -0.0626809 -0.1194026 -0.0323938 0.1015814 0.0390866 -0.1558964 0.0359476 0.1284821 0.054605 0.0033757 -0.00613 0.0250578 0.0502437 -0.0733586 -0.0144286 -0.0640031 -0.0624226 0.0506274 -0.0674676 0.0172381 -0.0147787 -0.0765262 0.0379744 -0.0157549 0.0393427 0.0760409 -0.1210805 0.0382805 0.0268745 0.0119693 0.09769 0.0046168 0.0404099 0.0165274 0.0671472 0.07295 -0.0940971 -0.0020324 -0.0613186 -0.1011886 0.0207075 -0.0092278 -0.0094536 0.0986748 0.0923577 0.0319755 0.034691 0.0186503 0.0721714 -0.0946603 0.0280437 -0.0466974 -0.0608018 0.0514302 -0.1116419 0.0019067 -0.1013653 -0.0641721 -0.0184574 0.0141278 -0.0003961 0.0877589 -0.1327829 0.0671 0.0590816 0.0422794 0.0876171 -0.0246518 0.0043232 -0.0220093 0.0802224 0.0991708 0.0420207 -0.0620225 0.0500603 0.0599373 0.0940893 -0.0635837 0.0513126 0.00336 -0.02273 0.0254531 0.0702528 0.0082273 0.0450248 -0.0765962 0.0209886 -0.0600245 -0.0568411 -0.0158042 -0.064046 0.0597685 -0.0003856 -0.0061295 0.0172395 0.0238942 0.0259621 0.0717353 unknown
polarizability: 108.3413999|-2.6963613|68.909556|1.5668206|-2.2665364|74.6398479 unknown
InChI: InChI=1S/C5H10BrNO2/c1-5(2,3-4-6)7(8)9/h3-4H2,1-2H3
charge 0 multiplicity 1
19 atoms
Br 3.748452 -0.275741 -0.116661
O  -1.86295 -1.230985 -0.993337
O  -0.879977 -1.507301 1.03719
N  -1.164105 -0.804173 -0.005265
C  -0.558145 0.647855 -0.082376
C  0.946661 0.463826 -0.479442
C  -1.293308 1.421627 -1.190803
C  -0.747602 1.308442 1.298397
C  1.834471 -0.215829 0.56898
H  0.997194 -0.09755 -1.430738
H  1.337291 1.477883 -0.685324
H  -2.379506 1.450806 -1.001792
H  -0.914037 2.45871 -1.206719
H  -1.132186 0.968966 -2.182031
H  -0.192606 2.262948 1.320432
H  -1.813952 1.527179 1.4813
H  -0.384524 0.663918 2.113548
H  1.899411 0.341622 1.514026
H  1.567118 -1.263805 0.758915
