program: Gaussian 09
title: 000272434
version: EM64L-G09RevD.01
frameworkgroup: C1[X(C10H8N2O2)]
method: RPBEPBE
basis: SDD
operation: Freq
keyword: #p
keyword: freq=noraman
keyword: PBEPBE/SDD
title: #p freq=noraman PBEPBE/SDD
converged: YES YES NO YES
title: Mulliken charges:
elementType: O O N N C C C C C C C C C C H H H H H H H H
charge: -0.200251 -0.205680 -0.227681 0.021834 0.554646 -0.496669 -0.370039 -0.164623 -0.159877 0.390768 -0.189682 -0.387415 -0.301282 -0.302675 0.286705 0.238635 0.238305 0.245910 0.240928 0.290965 0.248122 0.249056
chargesum: 0.00000
title: Mulliken charges with hydrogens summed into heavy atoms:
elementType: O O N N C C C C C C C C C C
charge: -0.200251 -0.205680 -0.227681 0.021834 0.554646 -0.209963 -0.131405 0.073682 0.086033 0.390768 0.051246 -0.096451 -0.053160 -0.053619
polarizability: 2.14433361e+02 -1.05489437e+01 1.44069684e+02 -1.27672980e-03 -1.62741983e-02 4.86789261e+01
1716.lowfreq: -47.3911 -10.2883 -2.8152 -0.0005 0.0003 0.0008 6.4277 52.8979 104.9772
frequency: -47.3806 52.8979 104.9747 124.9164 163.5617 253.5990 258.9400 323.3868 389.2134 422.3408 444.5789 530.0730 533.2236 599.4165 611.2692 645.5512 666.9501 673.2111 699.0015 706.3325 722.2437 804.7361 811.6020 836.6487 857.8015 886.2257 909.7413 923.7549 927.0229 985.3972 990.7580 1025.4952 1075.0622 1077.2553 1085.8033 1098.4943 1134.4226 1189.1164 1216.7672 1260.7347 1274.2752 1308.1625 1335.9104 1377.8599 1397.6056 1408.8277 1450.1596 1468.8386 1504.3184 1531.4320 1591.0101 1625.2918 3154.7010 3180.7949 3195.5254 3197.5953 3216.8708 3231.4566 3256.5663 3266.3292
redmass: 3.2922 12.5122 4.8158 7.0205 5.1212 4.1924 5.6552 8.8283 6.7211 3.2838 6.0201 4.8954 5.8230 2.5169 2.5994 7.1747 2.0132 1.4982 9.8457 5.9001 1.4049 1.4755 9.1365 1.3357 5.7557 1.3675 1.5498 1.4282 3.2329 5.7966 1.3449 1.7625 1.4515 1.3940 2.0415 2.1822 1.6433 1.2278 7.5980 1.6649 1.6768 1.8878 2.5893 11.1997 7.0234 3.8370 3.2808 3.6082 3.2106 4.6963 6.7351 7.0554 1.0885 1.0937 1.0926 1.0955 1.0901 1.0958 1.0992 1.1085
irintensity: 0.3291 0.1042 0.0633 1.7161 1.2309 0.0429 0.5402 0.9952 1.5517 0.4694 0.2390 6.7405 0.4857 0.0421 9.9562 2.1142 1.3046 1.8734 39.5125 26.9221 171.5306 44.7036 8.8287 1.4325 0.2861 0.6724 22.2110 14.7430 23.2599 1.2689 1.6788 34.7864 19.3781 31.2661 15.1762 26.8991 13.9375 12.0979 276.0629 10.2799 3.9762 31.4030 149.9867 98.3905 15.9536 14.0283 5.6186 23.7051 306.9079 0.0060 0.0290 101.0960 10.4800 5.3306 0.4356 11.8222 3.9783 1.6787 0.5731 2.2979
temp: 298.150 k
press: 1.00000 atm
elementType: 8 8 7 7 6 6 6 6 6 6 6 6 6 6 1 1 1 1 1 1 1 1
symmnumber: 1
zpe: 424650.7 jmol-1
zpe.correction: 0.161741 hartree
zpe.thermalcorrener: 0.171950 hartree
zpe.thermalcorrenthalpy: 0.172894 hartree
zpe.thermalcorrgfe: 0.125119 hartree
zpe.sumelectzpe: -644.740171 hartree
zpe.sumelectthermal: -644.729962 hartree
zpe.sumelectthermalent: -644.729018 hartree
zpe.sumelectthermalfe: -644.776793 hartree
dipole: 3.5006 3.4582 0.0005
dipole: 4.9207
quadrupole: -91.6592 -72.8665 -85.1386
quadrupole: -7.7782 -0.0028 -0.0061
quadrupole: -8.4378 10.3549 -1.9172 -7.7782 -0.0028 -0.0061
hfenergy: -644.9019118 hartree
pointgroup: C01 [X(C10H8N2O2)]
dipole: -1.3706491 1.3672066 -0.0001919 debye
dipolederiv: -0.9713601 -0.0381521 0.0000066 0.0296803 -0.4612993 0.0000279 -0.0000911 -0.000006 -0.222872 -0.5379063 0.0359724 -0.0000194 0.1149371 -0.8194195 -0.0000048 -0.0000096 0.0000635 -0.2259193 -1.6178307 -0.4628676 -0.0000384 -0.5683692 -0.2611697 0.0000971 0.0000925 -0.0000841 -0.017094 1.6000963 -0.2361215 0.0000504 -0.4543032 1.2692291 -0.0000503 0.0000526 -0.0000448 0.1875944 1.6492136 0.5482994 0.0000588 0.6371356 0.0298281 -0.0000781 0.0000094 0.0000049 0.097693 -0.2981813 -0.3421225 0.0000242 0.2566619 -0.0292993 -0.0000282 0.0001917 0.0000007 -0.1321613 -0.1173291 -0.0538586 0.0000535 -0.3872396 -0.0634601 -0.0000468 -0.000155 -0.0000872 -0.1452468 0.6687202 0.0949831 -0.0000741 -0.2280654 -0.1857508 0.0000914 -0.000171 -0.0000264 -0.2062644 0.2858615 0.2681181 -0.0000391 0.6338447 0.1632393 0.000077 0.0000787 0.0001042 -0.1925049 -0.2377076 0.3536181 -0.0000755 0.4038605 -0.1056728 0.0000333 -0.0000057 0.0000069 0.0610249 -0.0680553 0.0306148 0.0000132 0.1036494 0.2211073 -0.0000319 0.0000161 -0.0000287 -0.1285478 -0.1687966 0.0197538 0.0000016 -0.2730696 -0.0914385 0.0000009 0.0000532 0.0000031 -0.1318412 -0.2005819 -0.1252032 -0.0000866 -0.4302218 -0.0800029 0.0001992 -0.0004071 0.0001348 -0.2241202 -0.4469006 -0.1207885 -0.0000115 0.1587751 0.1417399 0.0002024 0.0002507 0.0003422 -0.2249233 0.167532 -0.026376 -0.0000123 -0.0692886 0.0478674 0.0000183 0.0000499 0.0000217 0.175825 0.0013884 0.100512 -0.0000298 0.0944756 0.0619933 0.0000347 -0.0000783 0.0000053 0.1598007 0.1205494 -0.0560126 -0.0000355 -0.0113812 -0.0215583 -0.0002259 0.000007 -0.0001042 0.2175387 0.0373665 0.0885948 0.0001625 0.0533816 0.0697248 -0.0001363 0.0000739 -0.0000941 0.2154132 0.0732049 -0.0206096 -0.0000011 -0.0292639 -0.0853055 0.0000215 -0.0000046 0.0000153 0.1550021 0.0548461 -0.0402104 -0.0000048 -0.0111481 0.1279771 0.0000116 -0.0000048 -0.0000109 0.1820952 -0.0516897 0.0546927 0.0000806 0.0557689 0.0885353 -0.0000868 0.0001508 -0.0000606 0.1999383 0.0575604 -0.0728365 -0.0000232 -0.0798199 -0.0168647 -0.0001263 -0.0000993 -0.0001555 0.1995696 unknown
polarizability: 214.5336314|10.2085647|143.9694144|-0.0011981|0.0162802|48.6789261 unknown
InChI: InChI=1S/C10H8N2O2/c13-12(14)10-5-3-4-9(8-10)11-6-1-2-7-11/h1-8H
charge 0 multiplicity 1
22 atoms
O  4.21437 -0.455352 0.000061
O  2.722228 -2.178289 0.000031
N  -1.852467 -0.017906 -0.000218
N  3.01112 -0.919851 -0.000085
C  -0.511013 0.461446 -0.000191
C  0.574824 -0.448006 -0.000076
C  -0.233818 1.856647 -0.000271
C  -3.018182 0.777671 0.000857
C  -2.247521 -1.372798 -0.001158
C  1.887992 0.057136 -0.000021
C  1.094211 2.32814 -0.000235
C  2.184588 1.435225 -0.000125
C  -4.125854 -0.065843 0.000111
C  -3.638505 -1.425004 -0.00056
H  0.441829 -1.53116 0.000064
H  -1.04928 2.583738 -0.000437
H  -2.978522 1.862267 0.001835
H  -1.527308 -2.184942 -0.002126
H  1.27628 3.407288 -0.000316
H  3.222903 1.77318 -0.000105
H  -5.165218 0.256635 0.000457
H  -4.235757 -2.334623 -0.000992
