program: Gaussian 09
title: 000272426
version: EM64L-G09RevD.01
frameworkgroup: C1[X(C11H11N)]
method: RPBEPBE
basis: SDD
operation: Freq
keyword: #pfreq=noraman
keyword: PBEPBE/SDD
title: #p freq=noraman PBEPBE/SDD
converged: NO YES NO NO
title: Mulliken charges:
elementType: N C C C C C C C C C C C H H H H H H H H H H H
charge: -0.213838 0.499926 0.450925 -0.354808 -0.354824 -0.399666 -0.399465 -0.174824 -0.174823 -0.312487 -0.312488 -0.807562 0.224367 0.224367 0.230621 0.230617 0.237158 0.237158 0.241905 0.241905 0.224838 0.224828 0.236171
chargesum: 0.00000
title: Mulliken charges with hydrogens summed into heavy atoms:
elementType: N C C C C C C C C C C C
charge: -0.213838 0.499926 0.450925 -0.130441 -0.130457 -0.169045 -0.168847 0.062334 0.062335 -0.070582 -0.070584 -0.121726
polarizability: 2.04945706e+02 -2.14419168e-03 1.20481691e+02 5.08624118e-01 -8.86463777e-05 5.36280577e+01
1716.lowfreq: -65.9333 -8.1778 -4.1624 0.0005 0.0006 0.0007 14.9584 44.0029 78.2806
frequency: -65.9317 43.2769 78.2805 169.5206 184.1874 325.8383 330.4096 335.3860 400.4840 448.7884 510.4852 602.5782 604.1934 611.9845 637.5009 674.5658 703.2510 726.7014 791.7009 818.0921 818.8966 829.6429 860.1142 880.9325 912.8368 939.1373 959.9432 987.1768 1004.8964 1017.2221 1047.5911 1076.9114 1080.0320 1124.6401 1133.0034 1204.2317 1233.8903 1262.4388 1285.7946 1322.6400 1328.5733 1375.2630 1399.6047 1408.8484 1422.5260 1473.7482 1474.2484 1475.5828 1522.3166 1524.6328 1589.9534 1630.1558 2970.1854 3050.2225 3079.2115 3124.5534 3126.9235 3165.1096 3169.2948 3204.5996 3220.0004 3246.5783 3256.4831
redmass: 3.1118 1.0244 4.0197 3.8292 4.2061 2.9029 4.8384 4.5045 2.8085 3.7901 2.5516 2.5491 5.1282 2.4969 6.9351 1.4419 2.1089 1.6631 4.9824 1.6294 1.2731 1.3303 5.7605 1.3441 3.9110 1.3345 1.3767 1.4007 3.1554 1.7500 1.5422 1.2758 1.8712 1.8233 1.3788 1.1464 2.6173 1.5390 2.0200 3.8011 1.4546 7.3628 1.2261 3.9673 3.0945 1.0575 1.1138 3.4213 2.8559 4.5121 6.2808 6.4223 1.0390 1.0948 1.0996 1.0896 1.0895 1.0936 1.0945 1.0898 1.0960 1.0991 1.1083
irintensity: 0.0047 0.5661 0.4621 0.0174 0.1654 0.3325 1.9993 2.1573 0.0107 0.1485 21.4079 0.0000 6.9856 15.4621 0.0504 0.0002 33.8256 115.4716 0.7652 87.0318 0.0047 0.0262 0.1832 0.0000 22.1576 2.3819 0.0073 0.5884 0.2185 27.4277 20.0660 19.7313 22.5311 29.8843 16.4610 3.6027 3.6767 8.4300 2.8831 133.0085 0.2252 0.3963 6.9018 13.6463 0.0867 13.7303 12.3519 61.6130 251.0279 0.1972 3.0046 27.9227 45.3694 23.6649 18.4489 14.8636 26.0047 18.6382 4.9798 3.9783 3.5189 3.0204 2.1604
temp: 298.150 k
press: 1.00000 atm
elementType: 7 6 6 6 6 6 6 6 6 6 6 6 1 1 1 1 1 1 1 1 1 1 1
symmnumber: 1
zpe: 491771.7 jmol-1
zpe.correction: 0.187306 hartree
zpe.thermalcorrener: 0.196783 hartree
zpe.thermalcorrenthalpy: 0.197728 hartree
zpe.thermalcorrgfe: 0.151862 hartree
zpe.sumelectzpe: -479.667613 hartree
zpe.sumelectthermal: -479.658135 hartree
zpe.sumelectthermalent: -479.657191 hartree
zpe.sumelectthermalfe: -479.703057 hartree
dipole: 1.8240 -0.0002 0.0572
dipole: 1.8249
quadrupole: -64.4022 -61.2882 -77.9841
quadrupole: -0.0008 0.2176 -0.0002
quadrupole: 3.4893 6.6033 -10.0926 -0.0008 0.2176 -0.0002
hfenergy: -479.8549186 hartree
pointgroup: C01 [X(C11H11N1)]
dipole: -0.7176324 -0.0000974 -0.0215656 debye
dipolederiv: -1.6328125 -0.0000258 0.0022594 -0.0000192 -0.0698129 0.0000388 0.0044811 -0.0000095 -0.0095417 1.5698952 0.0000208 -0.0055067 0.0000659 0.010282 -0.0000187 -0.0080114 0.0000066 0.066518 0.3194991 0.0000631 0.0165978 0.0001831 -0.129592 0.0000032 0.1074109 0.0000021 -0.042835 -0.2780002 -0.0172419 0.0002948 0.2757357 0.0158564 0.0045197 -0.0065623 0.0033721 -0.1610506 -0.2780311 0.0172453 0.0003025 -0.2757369 0.0158423 -0.0045559 -0.0065872 -0.0034177 -0.161052 -0.0435115 0.007168 0.0013819 -0.160626 0.1303183 -0.0065578 -0.0077894 -0.0066812 -0.1667842 -0.0435195 -0.0071592 0.0013959 0.1605991 0.1303688 0.0065299 -0.0078087 0.006666 -0.1667989 0.5686056 0.1296068 -0.0012906 0.4616468 -0.0883619 -0.0006969 -0.0020257 -0.0006571 -0.204014 0.5686489 -0.1295859 -0.0012637 -0.4616335 -0.0883825 0.0007024 -0.0020367 0.0006376 -0.2040151 -0.4157171 0.0316399 -0.0004328 0.3307834 0.0598493 -0.0002206 0.0006805 0.0000367 -0.2441729 -0.4157094 -0.0316558 -0.0004398 -0.3308074 0.0598382 0.000259 0.0005772 0.0000277 -0.2441734 -0.1217327 -0.000051 -0.0078175 -0.0003462 0.0832402 0.0000032 -0.133426 -0.0000139 0.0738036 0.046005 -0.1029088 0.000596 -0.1061337 -0.0296589 -0.0007258 0.0035425 -0.0015877 0.1587271 0.0459974 0.1029174 0.0005797 0.1061333 -0.0296506 0.00076 0.0035082 0.0016174 0.1587235 0.0114013 0.0960082 0.0033346 0.1042761 -0.0606843 0.0012562 0.0059913 -0.0034434 0.1484655 0.0114334 -0.0959913 0.0033427 -0.1042756 -0.0606986 -0.0012296 0.0060068 0.0034651 0.1484564 0.0871556 0.0891289 0.0005415 0.0524957 0.0034806 -0.0001634 0.0004541 -0.0003726 0.214867 0.0871613 -0.0891257 0.0005062 -0.0524954 0.0034745 0.0001156 0.0004434 0.0003651 0.2148669 -0.0168137 -0.0908951 0.0006238 -0.0950294 0.0315936 0.0002928 0.0005625 0.0002982 0.20142 -0.0168208 0.0908936 0.0006303 0.0950283 0.0315994 -0.0003088 0.0006179 -0.000318 0.2014199 0.0068539 -0.0257771 0.0224764 -0.115 -0.0657482 0.1008615 0.0835991 0.079958 0.0598652 0.0070117 0.0257794 0.0223805 0.1152466 -0.0661467 -0.100598 0.0833346 -0.0797268 0.0602307 -0.0669998 -0.0000538 -0.0604928 -0.0000906 0.1129928 -0.0002665 -0.1269623 -0.0002247 -0.1029261 unknown
polarizability: 204.9467617|0.003827|120.4816913|0.3145356|-0.000318|53.6270019 unknown
InChI: InChI=1S/C11H11N/c1-10-4-6-11(7-5-10)12-8-2-3-9-12/h2-9H,1H3
charge 0 multiplicity 1
23 atoms
N  1.429546 0.000025 -0.000166
C  -0.004403 0.000002 0.004376
C  -2.877027 -0.000049 0.014429
C  -0.73021 1.218863 0.008431
C  -0.730169 -1.21889 0.008577
C  -2.139561 1.210804 0.014959
C  -2.139511 -1.210883 0.015102
C  2.255701 1.140025 -0.003062
C  2.255739 -1.139947 -0.003314
C  3.58598 0.721597 -0.007367
C  3.586004 -0.721473 -0.007359
C  -4.394855 -0.000102 -0.010393
H  -0.207246 2.17906 0.010572
H  -0.207164 -2.179065 0.010866
H  -2.675796 2.167512 0.021197
H  -2.675713 -2.16761 0.021461
H  1.848574 2.146987 -0.001787
H  1.848645 -2.146923 -0.002275
H  4.457741 1.374685 -0.010136
H  4.457787 -1.374532 -0.01016
H  -4.809548 -0.892523 0.491741
H  -4.809572 0.893368 0.489839
H  -4.779544 -0.001227 -1.049528
