program: Gaussian 09
title: 000272425
version: EM64L-G09RevD.01
frameworkgroup: C1[X(C10H8ClN)]
method: RPBEPBE
basis: SDD
operation: Freq
keyword: #p
keyword: freq=noraman
keyword: PBEPBE/SDD
title: #p freq=noraman PBEPBE/SDD
converged: NO NO NO NO
title: Mulliken charges:
elementType: Cl N C C C C C C C C C C H H H H H H H H
charge: -0.050562 -0.217453 0.520811 -0.170831 -0.170830 -0.342705 -0.342705 -0.306883 -0.306884 -0.211418 -0.211418 -0.128107 0.237746 0.237745 0.232786 0.232787 0.244620 0.244621 0.254339 0.254339
chargesum: 0.00000
title: Mulliken charges with hydrogens summed into heavy atoms:
elementType: Cl N C C C C C C C C C C
charge: -0.050562 -0.217453 0.520811 0.066915 0.066915 -0.109918 -0.109918 -0.062262 -0.062263 0.042921 0.042921 -0.128107
polarizability: 2.15178270e+02 6.43297545e-06 1.14216486e+02 2.18011064e-02 1.26313144e-04 4.61487734e+01
1716.lowfreq: -62.3323 -6.2052 -5.3668 -0.0025 -0.0023 0.0015 20.7560 64.6080 148.1983
frequency: -62.2689 64.6044 148.1971 170.7585 285.7288 286.2463 322.5621 402.5501 446.7303 500.7528 502.8413 601.7514 610.6254 626.4335 675.4729 693.9597 714.9739 726.0159 804.6311 822.3501 835.2729 859.3006 886.2397 910.2056 938.3876 949.8748 992.1460 1015.1081 1077.5056 1079.0391 1082.7696 1122.2416 1128.1150 1203.4756 1262.0780 1283.5569 1314.4930 1326.7673 1373.0568 1407.2084 1417.1041 1471.5790 1501.5945 1527.4981 1584.9218 1611.9382 3156.5377 3156.6123 3176.9511 3180.8230 3203.1112 3217.9865 3243.5946 3253.5606
redmass: 3.1154 7.4770 6.3631 5.9835 11.6869 5.4537 5.3703 2.8724 4.1271 7.9067 2.7750 2.5502 2.5671 7.1940 1.4412 2.7063 7.0049 1.5325 1.2658 1.6857 1.3196 5.7864 1.3467 3.9947 1.3511 1.3643 4.0123 1.8183 2.4518 1.2696 2.2288 1.4440 1.6587 1.1434 1.6069 1.8528 1.4703 3.4709 8.4065 3.6372 3.4240 3.3369 2.8296 4.7209 7.2488 6.3051 1.0890 1.0887 1.0955 1.0964 1.0899 1.0958 1.0993 1.1086
irintensity: 0.0000 0.1146 0.4872 0.2958 0.4014 0.2259 1.1169 0.0000 0.0103 31.6839 24.4441 0.0000 13.8648 0.1213 0.0000 12.8805 7.8556 133.4970 0.0000 107.5492 0.2337 0.2582 0.0000 38.0602 0.1218 0.0000 12.4914 24.2709 38.2937 18.9690 6.1922 14.5601 44.8727 18.9929 9.0105 3.5004 0.1748 144.7090 0.4225 22.4980 1.6420 7.0572 379.8488 0.0077 0.3276 32.0408 0.0946 9.3362 9.6195 3.8785 3.3651 2.3715 2.3272 2.0243
temp: 298.150 k
press: 1.00000 atm
elementType: 17 7 6 6 6 6 6 6 6 6 6 6 1 1 1 1 1 1 1 1
symmnumber: 1
zpe: 395711.8 jmol-1
zpe.correction: 0.150719 hartree
zpe.thermalcorrener: 0.159591 hartree
zpe.thermalcorrenthalpy: 0.160535 hartree
zpe.thermalcorrgfe: 0.115951 hartree
zpe.sumelectzpe: -899.827658 hartree
zpe.sumelectthermal: -899.818786 hartree
zpe.sumelectthermalent: -899.817842 hartree
zpe.sumelectthermalfe: -899.862425 hartree
dipole: 1.0951 0.0000 -0.0001
dipole: 1.0951
quadrupole: -82.2831 -64.7937 -83.3378
quadrupole: 0.0000 -0.0016 0.0008
quadrupole: -5.4782 12.0112 -6.5329 0.0000 -0.0016 0.0008
hfenergy: -899.9783764 hartree
pointgroup: C01 [X(C10H8Cl1N1)]
dipole: -0.4308648 -0.0000016 0.0000557 debye
dipolederiv: -0.9555301 -0.0000038 -0.0001239 -0.0000037 -0.120635 -0.000041 -0.0001062 -0.0000284 -0.0617538 -1.7260727 -0.0000075 -0.0003933 -0.0000097 -0.0715327 -0.0001221 -0.0009085 0.0000699 -0.0089161 1.6793756 0.0000083 0.0002103 0.0000083 -0.0005442 0.00014 0.0003518 -0.0000378 0.0796363 0.5910314 -0.1329493 0.0003704 -0.4844165 -0.0850726 -0.000298 0.0003467 0.0001089 -0.204142 0.591026 0.1329547 0.0003058 0.4844254 -0.0850661 -0.0000491 0.0004533 -0.0003476 -0.204141 -0.2601731 0.0131796 -0.0000549 -0.2599452 0.0216896 0.0001213 0.0000607 0.0001395 -0.1628758 -0.2601745 -0.0131828 0.0000482 0.2599423 0.0216908 0.0002389 -0.0000844 0.0002261 -0.1628758 -0.4220721 -0.0347087 -0.0000918 -0.3595293 0.0629603 -0.0003978 0.0004693 -0.00031 -0.2351587 -0.422078 0.034704 -0.0001881 0.3595233 0.0629624 -0.0000999 -0.0004925 -0.0002612 -0.23516 -0.187646 0.0036273 -0.0000275 0.0813113 0.0677702 0.0001245 0.0000202 0.0001266 -0.1009027 -0.1876461 -0.0036302 -0.0000198 -0.0813148 0.0677704 0.0000995 -0.0001082 0.0001206 -0.1009025 1.222376 0.0000058 0.0001753 0.000006 0.0145017 0.0000409 0.0001706 0.0000325 -0.08872 0.0861142 -0.089058 0.0000619 -0.0522893 0.0076615 0.0002162 -0.0000101 0.0000324 0.2159007 0.0861129 0.089059 -0.0001764 0.0522901 0.0076626 0.000269 -0.0001425 0.0003176 0.2159 0.0421859 0.0952792 0.0000647 0.0927805 -0.0142454 -0.0001365 0.0001478 -0.0000974 0.1621756 0.0421882 -0.0952784 -0.0001012 -0.0927797 -0.0142465 -0.0001768 -0.0001374 -0.0001713 0.1621757 -0.0098232 0.0875748 -0.0000927 0.0909548 0.0349096 0.0001741 -0.000096 0.0001466 0.200907 -0.0098205 -0.0875747 0.0000618 -0.0909546 0.0349083 0.0001281 0.0000856 0.0001443 0.2009075 0.0503139 -0.0640361 -0.0000598 -0.0685154 -0.0065727 -0.0001216 -0.000074 -0.0001104 0.1639729 0.0503124 0.0640369 0.0000312 0.0685163 -0.0065721 -0.0001097 0.0000537 -0.000101 0.1639727 unknown
polarizability: 215.1782696|0.0004686|114.2164862|0.0218011|-0.0001262|46.1487734 unknown
InChI: InChI=1S/C10H8ClN/c11-9-3-5-10(6-4-9)12-7-1-2-8-12/h1-8H
charge 0 multiplicity 1
20 atoms
Cl 4.647797 0.000018 0.000609
N  -1.428628 -0.00001 -0.000061
C  0.000988 -0.000003 0.000054
C  -2.255225 1.141272 -0.00172
C  -2.255214 -1.1413 0.000476
C  0.726065 1.221372 0.000882
C  0.726076 -1.221372 -0.000647
C  -3.584058 0.722225 -0.00114
C  -3.584052 -0.722266 -0.000092
C  2.134783 1.223658 0.001023
C  2.134794 -1.223644 -0.000472
C  2.833887 0.00001 0.000378
H  -1.848514 2.148842 -0.002641
H  -1.848494 -2.148867 0.001816
H  0.206299 2.182555 0.001509
H  0.206319 -2.182559 -0.00154
H  -4.456038 1.375539 -0.001764
H  -4.456025 -1.375588 0.000401
H  2.681359 2.171794 0.001688
H  2.681379 -2.171776 -0.00106
