program: Gaussian 09
title: 000272423
version: EM64L-G09RevD.01
frameworkgroup: C1[X(C11H11N)]
method: RPBEPBE
basis: SDD
operation: Freq
keyword: #pfreq=noraman
keyword: PBEPBE/SDD
title: #p freq=noraman PBEPBE/SDD
converged: NO YES NO NO
title: Mulliken charges:
elementType: N C C C C C C C C C C C H H H H H H H H H H H
charge: -0.416717 0.397512 0.264736 -0.540985 0.449540 -0.405167 -0.389746 -0.412625 -0.229958 -0.246649 -0.275775 -0.815703 0.233862 0.205833 0.311955 0.240386 0.231946 0.221391 0.249808 0.242093 0.225762 0.222840 0.235660
chargesum: 0.00000
title: Mulliken charges with hydrogens summed into heavy atoms:
elementType: N C C C C C C C C C C C
charge: -0.104761 0.397512 0.264736 -0.307123 0.449540 -0.199334 -0.149360 -0.180678 -0.008567 0.003159 -0.033682 -0.131442
polarizability: 2.04511759e+02 6.56777321e+00 1.28454180e+02 -8.43024543e-01 2.13066895e+00 5.70360360e+01
1716.lowfreq: -8.8687 -0.0007 -0.0003 -0.0002 3.1693 10.7247 13.8242 46.4344 102.3450
frequency: 12.9140 46.2717 102.3418 128.8512 205.6778 269.2183 299.9555 349.7678 433.3021 446.8786 517.8230 550.3871 581.7465 609.5604 666.4060 670.2262 698.3538 712.9755 784.3684 803.9404 823.4514 869.9151 874.5261 882.5673 905.2958 930.9145 973.2396 985.2183 993.6256 1041.6397 1047.1350 1058.3307 1098.4032 1117.4774 1131.1960 1186.8918 1209.3567 1258.8627 1307.0290 1316.8909 1370.4906 1393.2463 1396.2390 1408.3440 1437.9423 1452.8925 1473.2582 1474.5438 1486.1615 1564.7286 1595.2796 1619.4701 2975.7492 3057.4204 3085.4728 3113.2069 3126.6450 3128.8735 3152.0312 3207.3706 3221.7626 3243.9609 3605.8133
redmass: 1.0162 3.4079 4.3697 3.8637 2.9893 4.2775 3.5243 4.9488 3.0468 3.2591 4.9600 3.7956 1.4675 2.1046 4.9775 3.8259 1.7913 1.2683 1.3797 1.6086 4.9102 1.3941 4.8421 1.3430 1.4932 2.9376 1.3813 4.1946 1.6104 1.3736 1.5702 1.5616 1.7488 2.4028 1.3100 1.1184 2.2977 1.5464 1.3246 3.0758 4.6175 2.9304 1.2877 3.1597 2.6274 3.8481 1.2074 1.2227 2.1429 4.2987 5.5999 6.0281 1.0384 1.0953 1.0998 1.0858 1.0908 1.0911 1.0992 1.0905 1.0967 1.1082 1.0806
irintensity: 0.4196 2.2783 1.3547 0.8309 1.9983 0.4406 0.2884 0.0638 2.4909 4.3766 1.5708 5.8038 61.8572 2.3159 2.9837 1.6450 7.7665 131.4782 95.8286 4.2241 8.1980 0.3111 6.2510 1.5998 10.2723 5.7615 0.2217 1.0860 1.6360 31.3553 17.6647 22.1199 13.1028 15.2916 24.9917 4.3232 1.2060 5.2747 0.3851 8.8123 1.4867 5.7363 9.4459 7.6714 5.0703 1.9482 17.0355 10.4567 64.1636 0.2861 15.2080 85.4036 36.4164 23.2478 18.5415 7.3457 23.6691 16.0855 28.5796 6.5316 3.8978 3.3493 36.2541
temp: 298.150 k
press: 1.00000 atm
elementType: 7 6 6 6 6 6 6 6 6 6 6 6 1 1 1 1 1 1 1 1 1 1 1
symmnumber: 1
zpe: 493422.7 jmol-1
zpe.correction: 0.187935 hartree
zpe.thermalcorrener: 0.198401 hartree
zpe.thermalcorrenthalpy: 0.199345 hartree
zpe.thermalcorrgfe: 0.149780 hartree
zpe.sumelectzpe: -479.681988 hartree
zpe.sumelectthermal: -479.671522 hartree
zpe.sumelectthermalent: -479.670577 hartree
zpe.sumelectthermalfe: -479.720143 hartree
dipole: 0.1888 1.1820 0.5402
dipole: 1.3132
quadrupole: -61.8998 -60.5278 -77.1189
quadrupole: -5.1346 -1.1777 1.7693
quadrupole: 4.6157 5.9877 -10.6034 -5.1346 -1.1777 1.7693
hfenergy: -479.8699227 hartree
pointgroup: C01 [X(C11H11N1)]
dipole: -0.0903068 -0.4578834 0.2216389 debye
dipolederiv: 0.1192437 -0.1468602 0.0425449 -0.1819542 -0.5709387 0.0673112 -0.0373382 0.0150676 -0.2285371 0.9198834 0.150033 -0.0147029 0.152383 0.0516522 0.0214427 -0.0087574 -0.0032258 0.0789379 -0.4074406 -0.1184952 0.0321058 -0.1318253 0.2422137 -0.0947004 0.0733913 -0.0379065 -0.0173157 -0.4678033 0.0764085 0.0160866 0.2137781 0.00584 0.0273007 0.0042517 0.0047425 -0.1898074 0.3291262 -0.1560907 -0.0255342 -0.2163821 0.2639623 0.0306803 -0.1000464 0.0723071 -0.0054836 -0.2826414 -0.0441405 -0.020902 -0.2793827 -0.0641082 0.026644 -0.0150318 0.0348411 -0.2095329 0.1926241 -0.0007489 0.024385 0.0486229 -0.0904582 -0.0486796 0.0645848 -0.0437569 -0.2162149 -0.1453336 0.0315804 -0.0051499 0.0803365 -0.2199576 -0.0076801 0.0053986 -0.0107718 -0.2066552 0.1319436 0.0068158 0.0041847 0.0806307 0.1455216 0.0218847 0.023986 0.022353 -0.1301975 -0.396994 0.1615604 -0.0455777 -0.0711244 0.1845158 -0.1008292 0.0297273 -0.0875519 -0.1916528 -0.1903989 0.0068532 0.0012203 0.2416269 -0.0502378 -0.0415749 -0.0997216 -0.0544133 -0.2380906 -0.0080356 0.0975731 0.0158574 0.1133621 -0.0602172 -0.0167988 0.0957209 -0.079094 0.0578324 0.076099 -0.0694193 -0.0081286 -0.0548518 -0.0756163 -0.0185348 -0.0123064 -0.0090903 0.1390641 -0.0234989 0.1341969 0.0148606 0.1099731 -0.0385534 -0.0219655 0.0181128 -0.0200555 0.1507406 0.2327961 -0.062835 0.0115204 -0.0470604 0.1886158 0.0356794 0.0259593 0.0471224 0.3030479 0.0794011 0.0905677 -0.0309996 0.0732828 0.0063468 0.060094 -0.0232036 0.0576129 0.1714826 -0.1423071 -0.0342313 0.0003777 -0.0148076 0.0853483 -0.0020177 -0.0047641 0.0003978 0.1593148 0.0431643 -0.0688037 -0.0040217 -0.0903468 -0.1190284 -0.0176133 -0.0092259 -0.0182335 0.1519331 0.0042868 0.0564436 -0.0276942 0.0813096 0.0459526 0.0533892 -0.0161827 0.052517 0.2099144 -0.0355149 -0.0880042 0.0148367 -0.099916 0.0545754 0.0366737 0.0117 0.0340406 0.1922976 0.0450546 -0.087641 0.0624056 0.0001374 -0.0772271 0.0804696 0.007005 0.106571 0.0582381 -0.1223813 0.0091862 -0.0816755 -0.0805895 0.0556518 -0.0425432 -0.1056226 0.0022182 0.0709259 0.0487267 0.0560512 0.0240006 0.0727978 0.0361466 -0.0486322 0.0723631 -0.0856916 -0.1102419 unknown
polarizability: 204.8803483|3.8930486|127.9752167|0.5115418|-3.5536715|57.1464103 unknown
InChI: InChI=1S/C11H11N/c1-9-4-2-5-10(8-9)11-6-3-7-12-11/h2-8,12H,1H3
charge 0 multiplicity 1
23 atoms
N  2.274201 -0.950904 0.286915
C  -0.119493 -0.223471 -0.017989
C  1.325121 0.040154 -0.013409
C  -1.044235 0.856141 0.051105
C  -2.442323 0.646446 0.046692
C  -0.63974 -1.547946 -0.094572
C  2.05245 1.218203 -0.285311
C  -2.932406 -0.684311 -0.022984
C  -2.031698 -1.770665 -0.090395
C  3.562283 -0.425032 0.2161
C  3.449356 0.925067 -0.149192
C  -3.401321 1.821192 0.150169
H  -0.659212 1.880145 0.126632
H  0.035216 -2.406534 -0.199212
H  2.043681 -1.894723 0.590645
H  1.619579 2.17068 -0.587766
H  -4.013702 -0.86559 -0.027618
H  -2.416852 -2.794652 -0.156401
H  4.439918 -1.031849 0.42835
H  4.278807 1.612867 -0.304131
H  -3.005897 2.714636 -0.364619
H  -4.384272 1.579472 -0.29064
H  -3.573959 2.101076 1.207631
