program: Gaussian 09
title: 000272446
version: EM64L-G09RevD.01
frameworkgroup: C1[X(C11H13N3O7)]
method: RPBEPBE
basis: SDD
operation: Freq
keyword: #p
keyword: freq=noraman
keyword: PBEPBE/SDD
title: #p freq=noraman PBEPBE/SDD
converged: YES YES NO NO
title: Mulliken charges:
elementType: O O O O O O O N N N C C C C C C C C C C C H H H H H H H H H H H H H
charge: -0.443124 -0.265052 -0.239344 -0.189887 -0.244886 -0.214400 -0.205290 -0.394791 0.023807 0.015815 -0.231637 -0.117894 0.338564 -0.681938 0.275016 0.231797 -0.279968 -0.506850 0.446219 -0.419865 -0.498558 0.262745 0.216485 0.392931 0.204632 0.251061 0.238473 0.282775 0.337293 0.373718 0.291697 0.254652 0.251789 0.244015
chargesum: 0.00000
title: Mulliken charges with hydrogens summed into heavy atoms:
elementType: O O O O O O O N N N C C C C C C C C C C C
charge: -0.069406 -0.265052 -0.239344 -0.189887 -0.244886 -0.214400 -0.205290 -0.001860 0.023807 0.015815 0.031108 0.098591 0.338564 0.012228 0.275016 0.231797 0.002808 -0.169557 0.446219 -0.128167 0.251898
polarizability: 2.69104716e+02 -1.38000424e+01 1.99017201e+02 6.09676292e-01 2.25619991e+01 1.09544367e+02
1716.lowfreq: -8.2563 0.0007 0.0009 0.0009 2.8754 6.2575 17.2111 34.2380 40.6555
frequency: 16.9054 34.2109 40.6492 57.5900 74.4104 79.2377 83.0039 94.4453 107.3083 126.6192 155.0662 165.8138 178.5411 192.2546 198.3536 245.6043 271.6641 289.9687 314.1577 332.4630 343.8290 351.2731 384.6925 406.0429 440.8857 444.9514 504.3150 517.9831 577.0619 599.5513 608.5469 644.6123 654.1459 680.0465 688.6086 706.6303 726.4384 731.7452 755.4114 811.9721 827.2474 840.1352 865.0062 882.1346 889.5345 907.3707 961.6474 968.4360 992.9372 1011.3706 1048.5547 1063.2565 1092.8420 1108.1028 1112.8471 1124.4537 1143.2754 1151.1132 1153.1244 1172.3465 1214.8433 1245.8585 1258.8528 1264.4309 1298.2129 1304.3499 1346.3238 1348.6460 1363.2993 1379.3378 1385.6745 1401.8301 1422.4367 1449.1917 1453.6748 1459.5338 1460.3676 1467.6200 1479.2301 1520.5139 1574.8516 1623.2726 1627.5499 2962.8401 3001.5298 3016.0299 3045.4313 3100.3437 3112.3765 3124.3329 3164.5394 3173.2631 3187.2044 3190.9020 3280.7367 3458.0036
redmass: 6.4335 5.1613 5.7180 13.3845 5.2996 1.4906 3.4640 4.4967 4.3557 4.6906 7.3416 5.2087 3.7794 4.9604 1.2666 6.1452 5.3586 4.4997 5.8793 6.4014 6.9066 8.0352 9.0834 7.0388 3.9591 3.0721 9.6506 3.6277 1.0954 5.7236 4.2460 6.1247 7.2366 6.8292 5.9487 7.4468 7.1703 4.8069 12.6315 4.3896 1.7884 3.1387 2.6529 1.5007 5.8098 2.8119 3.1904 1.4088 1.3399 2.0643 2.5240 2.1278 2.0849 3.3097 1.3227 2.4491 2.0821 1.6542 1.7053 7.2108 6.3990 1.5698 1.3687 1.2853 1.4261 1.9533 4.1864 1.4075 5.4323 1.8046 2.7218 1.3713 1.1905 3.6308 1.0494 1.1016 1.0515 2.5553 1.0603 4.1024 6.5292 7.9539 7.1223 1.0849 1.0369 1.0290 1.0848 1.0994 1.0999 1.1055 1.1059 1.0883 1.0919 1.0969 1.0783 1.0652
irintensity: 0.6604 0.9291 0.7030 0.1215 0.6593 1.6061 0.1326 4.5273 3.3487 1.1585 0.7177 2.3708 0.5527 8.8633 4.4220 2.2771 13.7609 9.0006 0.8598 1.5774 16.0917 5.6647 2.6503 12.3850 1.6717 17.7038 1.3482 9.8447 271.4773 2.6349 3.4580 4.7671 16.6852 14.8310 10.7889 8.7136 10.3432 4.0438 8.9203 6.5289 41.2332 19.4001 14.6790 78.8889 11.8681 13.5424 36.4129 27.6859 0.7971 17.0119 6.6212 58.6571 26.3558 34.4434 5.8324 54.9804 121.2762 7.6545 109.0057 366.1077 462.8139 72.3729 42.9212 36.6378 31.2787 106.8880 160.2993 26.2167 39.2731 62.8056 29.7660 38.1809 17.5871 5.7770 17.2698 8.5203 9.7344 2.2876 10.5607 171.2710 122.1893 209.7947 349.4083 53.2480 12.6739 21.2288 16.8170 19.9367 25.3208 17.8803 8.1513 0.8604 18.1663 3.4822 141.4313 50.3207
temp: 298.150 k
press: 1.00000 atm
elementType: 8 8 8 8 8 8 8 7 7 7 6 6 6 6 6 6 6 6 6 6 6 1 1 1 1 1 1 1 1 1 1 1 1 1
symmnumber: 1
zpe: 646702.3 jmol-1
zpe.correction: 0.246316 hartree
zpe.thermalcorrener: 0.266972 hartree
zpe.thermalcorrenthalpy: 0.267916 hartree
zpe.thermalcorrgfe: 0.194564 hartree
zpe.sumelectzpe: -1116.062209 hartree
zpe.sumelectthermal: -1116.041553 hartree
zpe.sumelectthermalent: -1116.040609 hartree
zpe.sumelectthermalfe: -1116.113961 hartree
dipole: 7.0690 6.0446 2.1552
dipole: 9.5474
quadrupole: -151.9027 -127.6217 -118.3928
quadrupole: 15.9092 5.2636 -10.2045
quadrupole: -19.2637 5.0174 14.2463 15.9092 5.2636 -10.2045
hfenergy: -1116.3085253 hartree
pointgroup: C01 [X(C11H13N3O7)]
dipole: -2.9699844 2.1606055 -0.7875475 debye
polarizability: 266.7168651|18.1388698|200.9774349|-2.182438|-23.8081918|109.9719832 unknown
InChI: InChI=1S/C11H13N3O7/c1-6(15)10(11(16)21-2)12-8-4-3-7(13(17)18)5-9(8)14(19)20/h3-6,10,12,15H,1-2H3
charge 0 multiplicity 1
34 atoms
O  -3.733607 -1.871813 0.1672
O  -2.607775 2.352397 0.255334
O  -3.701269 0.6837 1.454253
O  2.034977 -3.022686 1.088465
O  -0.223699 -2.813327 0.901709
O  4.284468 2.47817 -0.875767
O  5.062927 0.495795 -0.045261
N  -1.258029 -0.621539 -0.115463
N  0.990327 -2.33924 0.772572
N  4.105849 1.278877 -0.420197
C  -2.4420 0.094022 -0.603265
C  -3.546496 -0.956337 -0.962168
C  0.032358 -0.163667 -0.163456
C  -3.173115 -1.813447 -2.173451
C  -2.990206 1.04272 0.483118
C  1.159539 -0.978376 0.249553
C  0.340228 1.160296 -0.638967
C  2.485033 -0.505653 0.16287
C  2.722818 0.783636 -0.327557
C  1.649506 1.625084 -0.726464
C  -3.059732 3.358815 1.260155
H  -2.194917 0.691174 -1.49803
H  -4.482637 -0.393413 -1.167551
H  -1.411625 -1.560988 0.298064
H  -3.041753 -1.191377 -3.076832
H  -3.977588 -2.543087 -2.361776
H  -2.242629 -2.375495 -1.985874
H  -0.479355 1.830428 -0.906519
H  3.311788 -1.148425 0.475962
H  -4.028035 -1.335039 0.955213
H  1.872617 2.632379 -1.087911
H  -2.661439 3.097492 2.253688
H  -4.160872 3.379986 1.296268
H  -2.651357 4.312737 0.901586
