program: Gaussian 09
title: 000272421
version: EM64L-G09RevD.01
frameworkgroup: C1[X(C10H8ClN)]
method: RPBEPBE
basis: SDD
operation: Freq
keyword: #p
keyword: freq=noraman
keyword: PBEPBE/SDD
title: #p freq=noraman PBEPBE/SDD
converged: NO YES NO NO
title: Mulliken charges:
elementType: Cl N C C C C C C C C C C H H H H H H H H
charge: -0.060455 -0.222478 0.530151 -0.167523 -0.167232 -0.302142 -0.369218 -0.306461 -0.306179 -0.104859 -0.209123 -0.265564 0.238234 0.239533 0.255224 0.232650 0.245204 0.245541 0.234055 0.260640
chargesum: 0.00000
title: Mulliken charges with hydrogens summed into heavy atoms:
elementType: Cl N C C C C C C C C C C
charge: -0.060455 -0.222478 0.530151 0.070711 0.072301 -0.046918 -0.136568 -0.061256 -0.060637 -0.104859 0.024932 -0.004924
polarizability: 1.94139747e+02 5.45048144e+00 1.30415659e+02 2.36377136e-02 -1.33562123e-02 4.63133768e+01
1716.lowfreq: -56.8872 0.0006 0.0021 0.0023 1.5263 3.8396 12.1162 101.4381 137.6515
frequency: -56.8819 101.4353 137.6490 175.6712 252.2976 275.7181 355.3907 391.5162 432.5833 466.5566 554.6672 600.8426 616.4718 649.4785 670.8809 673.1697 723.4289 734.5113 776.6495 833.8962 858.9957 860.3796 881.8446 886.3199 921.8523 968.2763 979.4771 1022.3120 1073.8793 1077.0613 1079.7498 1099.9115 1134.8844 1190.3833 1261.7901 1276.9244 1308.3553 1331.7906 1381.8828 1405.9583 1437.3842 1467.1715 1495.9783 1528.1472 1581.7436 1614.1385 3147.1934 3175.5681 3184.1240 3189.1980 3209.7294 3225.1326 3253.7818 3263.1623
redmass: 3.3046 4.7072 7.5108 5.1289 4.2607 5.5440 8.2069 7.3818 3.0162 4.6007 4.5721 2.5198 2.5491 6.9462 2.0596 1.4627 1.4263 8.1010 1.4041 1.3497 5.7652 1.5447 1.4245 1.3559 3.5100 1.3336 5.7311 1.8417 2.4046 1.2796 1.7112 1.7075 1.6802 1.1282 1.5527 1.7528 1.9447 2.3897 9.4335 3.3466 3.2253 3.3325 3.0686 4.6763 6.6644 6.7622 1.0878 1.0925 1.0972 1.0931 1.0902 1.0965 1.0986 1.1076
irintensity: 0.1311 0.2956 0.3510 0.0310 0.0052 0.0229 2.2577 4.9922 5.4407 0.4204 0.7305 0.0009 15.1205 1.5685 5.5955 0.0328 169.0173 67.5925 62.8275 2.5667 0.4321 34.6488 3.7831 0.0983 12.7938 0.8930 14.9755 49.7652 18.4707 25.9559 37.8864 16.8050 9.7131 6.5821 5.4354 8.4205 35.7247 77.1603 3.7442 21.3362 17.4554 10.2862 268.9667 3.9065 60.4529 186.3126 9.7253 5.0930 6.4265 2.0422 3.7538 2.5375 1.6977 1.7034
temp: 298.150 k
press: 1.00000 atm
elementType: 17 7 6 6 6 6 6 6 6 6 6 6 1 1 1 1 1 1 1 1
symmnumber: 1
zpe: 395947.8 jmol-1
zpe.correction: 0.150809 hartree
zpe.thermalcorrener: 0.159654 hartree
zpe.thermalcorrenthalpy: 0.160598 hartree
zpe.thermalcorrgfe: 0.116177 hartree
zpe.sumelectzpe: -899.828023 hartree
zpe.sumelectthermal: -899.819178 hartree
zpe.sumelectthermalent: -899.818233 hartree
zpe.sumelectthermalfe: -899.862654 hartree
dipole: -0.7064 1.6773 0.0008
dipole: 1.8200
quadrupole: -76.7510 -66.3391 -83.3507
quadrupole: 3.4782 0.0086 -0.0077
quadrupole: -1.2707 9.1412 -7.8704 3.4782 0.0086 -0.0077
hfenergy: -899.9788314 hartree
pointgroup: C01 [X(C10H8Cl1N1)]
dipole: 0.1889756 -0.6906483 0.0004913 debye
dipolederiv: -0.46887 0.3030798 -0.0002407 0.412772 -0.5097083 0.0003453 -0.0003266 0.0003228 -0.0724039 -1.6969025 -0.2269166 -0.0000098 -0.264986 -0.1348324 -0.0001466 -0.0005315 -0.00011 -0.0151838 1.6984214 0.2254202 0.0000597 0.2403006 0.1846854 -0.0002281 0.0002582 -0.0000499 0.0990967 0.6718159 -0.019753 -0.0001904 -0.3583038 -0.1499028 0.0002045 0.0001569 0.0006133 -0.2036809 0.4590348 0.2100535 0.0002253 0.5765987 0.0172074 0.000576 -0.0000922 0.0002057 -0.1988185 -0.6022642 0.0526496 -0.0000972 0.3668782 -0.1532923 -0.0000047 -0.0002113 0.0000007 -0.1375729 -0.3514711 -0.0426901 0.0000702 -0.3765794 -0.1043855 -0.000163 0.0000458 -0.0001801 -0.1831413 -0.3276973 -0.0899279 -0.0003106 -0.418818 -0.0042348 0.0002609 -0.0006135 0.0002536 -0.2333971 -0.4577767 -0.0371255 -0.000163 0.2579823 0.1084289 0.0004455 0.0004992 0.0003754 -0.233914 0.8035508 -0.4160639 0.0003101 -0.627687 0.8249211 -0.0006971 0.0005263 -0.0006385 -0.0548361 0.2558714 -0.0638497 0.0001044 0.0540644 0.1627914 -0.0002116 -0.0000692 -0.0002139 -0.1328182 -0.2809165 0.1131851 -0.0001115 0.1615779 -0.3563698 0.0002077 -0.0001781 0.0001729 -0.1392938 0.107367 -0.0738696 -0.0000019 -0.032326 -0.0119466 -0.0002698 0.0000098 -0.0004504 0.2160497 0.0587749 0.0939062 0.000164 0.0599099 0.0334812 -0.0003282 0.000166 -0.0003094 0.2152191 0.1090075 -0.058622 0.0000604 -0.0643568 -0.0047254 0.0001512 0.0001406 0.0001227 0.1704602 0.0224277 0.1077534 -0.0001266 0.1018155 0.0144444 0.000152 -0.0001596 0.0001349 0.1674436 -0.0365084 0.0765285 0.0002661 0.0777019 0.0638329 -0.0002388 0.0000191 -0.0002673 0.2008352 0.0244146 -0.0862171 -0.0000348 -0.0917297 0.0047786 -0.0002829 0.0002571 -0.000186 0.2006358 0.050891 -0.0437453 0.0000217 -0.0623059 -0.0876524 0.0001707 0.0000723 0.0001682 0.1570599 -0.0391704 -0.0237956 0.0000046 -0.0125089 0.1024791 0.0000568 0.0000307 0.0000352 0.1782605 unknown
polarizability: 194.4611429|-3.0205947|130.0942687|-0.0028188|-0.004157|46.3133709 unknown
InChI: InChI=1S/C10H8ClN/c11-9-4-3-5-10(8-9)12-6-1-2-7-12/h1-8H
charge 0 multiplicity 1
20 atoms
Cl -3.542205 1.973905 -0.002052
N  1.315396 -0.000462 -0.000307
C  -0.091412 -0.252213 -0.000316
C  2.329064 -0.980053 -0.001037
C  1.933943 1.266051 0.001292
C  -1.010679 0.830088 -0.001106
C  -0.594066 -1.580873 0.000548
C  3.565498 -0.337879 -0.001852
C  3.315285 1.084013 0.000873
C  -2.388468 0.559372 -0.000991
C  -1.983791 -1.814841 0.000569
C  -2.909888 -0.747359 -0.000185
H  2.104167 -2.042149 -0.002171
H  1.361545 2.188599 0.002838
H  -0.673188 1.867973 -0.00194
H  0.085365 -2.43613 0.001374
H  4.535237 -0.833214 -0.003364
H  4.057493 1.880744 0.001764
H  -2.35454 -2.845051 0.001276
H  -3.988355 -0.924722 -0.000115
