program: Gaussian 09
title: 000272415
version: EM64L-G09RevD.01
frameworkgroup: C1[X(C6H11NO2)]
method: RPBEPBE
basis: SDD
operation: Freq
keyword: #p
keyword: freq=noraman
keyword: PBEPBE/SDD
title: #p freq=noraman PBEPBE/SDD
converged: YES YES NO NO
title: Mulliken charges:
elementType: O O N C C C C C C H H H H H H H H H H H
charge: -0.264535 -0.259986 -0.096505 -0.418406 -0.422470 -0.514897 0.256298 -0.264784 -0.661156 0.232160 0.256835 0.246292 0.234094 0.264574 0.257499 0.234601 0.225767 0.219091 0.228898 0.246628
chargesum: 0.00000
title: Mulliken charges with hydrogens summed into heavy atoms:
elementType: O O N C C C C C C
charge: -0.264535 -0.259986 -0.096505 0.070589 0.057917 0.007176 0.256298 0.195584 0.033461
polarizability: 9.79003761e+01 -4.43065793e+00 6.89702398e+01 -4.45036807e-01 8.49474495e-02 6.46593963e+01
1716.lowfreq: -11.4112 -10.0796 -0.0007 -0.0004 0.0004 6.5956 16.8755 56.6542 91.3342
frequency: -6.8714 56.5348 91.3239 132.0073 152.8140 215.9217 266.7114 321.8834 335.6980 367.7155 450.8283 541.2989 646.2176 708.5499 790.6358 806.8112 819.1469 822.4926 864.2849 950.1742 1003.7099 1023.4284 1027.5167 1071.9647 1094.7111 1098.6926 1112.9040 1132.1519 1140.9857 1155.2757 1255.2156 1276.9905 1300.2396 1323.7400 1354.3032 1390.8139 1420.8752 1446.1050 1458.0344 1463.8402 1465.0082 1483.4806 1634.2833 2993.1748 2994.4349 3030.5677 3052.1326 3072.3283 3080.1084 3088.4390 3093.3574 3119.7850 3173.3897 3191.0237
redmass: 3.7913 3.2504 3.5960 2.4595 2.4243 1.4043 3.1198 3.6455 1.9740 3.8819 3.4388 3.5254 4.3911 4.2643 1.6169 4.8951 1.0793 2.4010 3.6344 1.5624 2.4635 1.4250 2.6376 1.4983 2.1648 1.3021 2.5387 1.9393 1.4118 1.6571 1.1294 1.1180 4.5205 1.3078 1.2895 1.2312 1.0807 1.0798 1.0968 1.0459 1.1887 1.0516 7.9577 1.0361 1.0610 1.0594 1.0985 1.0479 1.0583 1.0973 1.1032 1.1063 1.1182 1.1182
irintensity: 0.2740 0.2510 0.0252 9.3371 2.2186 5.4847 3.9081 15.7134 4.1905 4.0043 1.9400 6.2264 23.9802 1.4725 8.0333 0.3300 10.7367 1.7772 13.2067 1.1049 18.9311 4.6019 128.5914 90.7815 38.7826 16.6899 123.4806 107.1774 1.8624 11.6309 3.3346 2.6663 20.9369 17.2245 3.5413 22.8973 31.9603 4.4795 12.5097 13.1209 1.6575 11.8892 140.6993 19.5193 24.9373 29.5722 6.7223 31.3788 29.9374 34.5585 0.9243 32.9958 3.6382 34.5840
temp: 298.150 k
press: 1.00000 atm
elementType: 8 8 7 6 6 6 6 6 6 1 1 1 1 1 1 1 1 1 1 1
symmnumber: 1
zpe: 432833.2 jmol-1
zpe.correction: 0.164857 hartree
zpe.thermalcorrener: 0.174172 hartree
zpe.thermalcorrenthalpy: 0.175117 hartree
zpe.thermalcorrgfe: 0.130103 hartree
zpe.sumelectzpe: -439.653125 hartree
zpe.sumelectthermal: -439.643810 hartree
zpe.sumelectthermalent: -439.642866 hartree
zpe.sumelectthermalfe: -439.687879 hartree
dipole: -2.1986 0.0113 0.1450
dipole: 2.2034
quadrupole: -48.7129 -58.7983 -52.1241
quadrupole: -1.9088 0.1977 1.4589
quadrupole: 4.4988 -5.5865 1.0877 -1.9088 0.1977 1.4589
hfenergy: -439.8179825 hartree
pointgroup: C01 [X(C6H11N1O2)]
dipole: -0.861133 -0.0965109 -0.0243408 debye
dipolederiv: -1.6635789 -0.1335577 0.1083492 -0.2989915 -0.3620144 0.0287604 0.1764476 0.0369949 -0.5066549 -0.7404742 -0.0695103 -0.0230456 -0.0616333 -0.3061248 -0.1039438 0.3536618 -0.0361057 -0.8433851 -0.6068344 -0.019694 0.100995 -0.0015886 -0.0675784 -0.1399638 0.202404 -0.1411126 -0.5461919 0.2293046 0.1319657 -0.0104028 0.0924436 0.0145502 0.0814865 -0.0019202 0.0293838 0.1078229 0.2576924 -0.0709938 0.0518181 -0.0339154 -0.0296571 0.0107917 0.0334252 0.0652027 0.1356529 0.4937313 -0.030131 -0.1491722 -0.0709816 0.1148129 -0.0591947 -0.197949 -0.0462368 0.0632227 1.5476281 0.2477663 -0.1298487 0.3433812 0.250195 0.1084323 -0.676787 0.0371647 0.9877184 0.7420307 0.015633 0.0796621 0.0777008 0.3306665 -0.048953 0.2892033 0.0089596 0.2842251 -0.0881734 0.0450004 -0.0388248 0.0278021 -0.0921776 0.0878367 -0.0951682 0.0445878 0.0161989 -0.0809287 -0.1204899 0.0287206 -0.1323204 -0.0126463 0.0589651 -0.001957 0.025119 0.0655125 0.0388954 0.0175257 -0.0960946 0.0260139 0.0875859 0.041527 -0.0420772 0.0826712 -0.0230817 0.0284987 -0.0699489 -0.0703461 -0.0447392 -0.022736 -0.0695739 -0.0146927 -0.1022188 0.05438 -0.1117325 0.104092 -0.0283716 0.1008344 0.0004399 -0.012045 -0.0605125 0.0159079 0.0894388 0.0053978 -0.0292162 0.0514093 -0.0519278 0.0507671 0.119179 0.0450701 0.0704186 -0.0073495 -0.0245032 0.0510358 0.0303479 0.0800216 -0.0446804 -0.0729111 0.0039695 -0.0243965 0.0999367 0.0065699 0.0787367 0.0398051 0.0191475 -0.0125564 -0.0576578 -0.063138 -0.1109436 -0.0077907 -0.0619866 -0.0654164 0.0367646 -0.0705486 0.0112868 0.0779052 0.035951 0.1133658 -0.0094332 -0.1137653 -0.049441 -0.1074355 -0.0352028 0.0741598 -0.0377505 -0.1320207 -0.0302196 0.0612016 0.1026553 0.0409228 0.0258225 0.06628 -0.0104975 -0.0767979 0.0633901 -0.1143121 -0.0415443 0.039573 -0.0742792 0.0998475 -0.0317758 0.0262048 0.0639076 0.0826997 0.0757697 0.0201208 unknown
polarizability: 98.0007204|2.2262822|64.8169614|-3.5190459|-0.4706859|68.7123305 unknown
InChI: InChI=1S/C6H11NO2/c1-2-9-6(8)5-7-3-4-7/h2-5H2,1H3
charge 0 multiplicity 1
20 atoms
O  -1.496239 -0.119434 0.773807
O  -0.171935 -0.061322 -1.147139
N  2.195358 0.563973 0.697874
C  2.650649 1.019503 -0.660345
C  2.765339 -0.448381 -0.252953
C  0.776857 0.555508 1.092364
C  -0.298077 0.099834 0.090018
C  -2.684867 -0.513434 -0.050003
C  -3.404418 0.726302 -0.587239
H  3.537212 1.662243 -0.650709
H  1.899035 1.247279 -1.424319
H  2.086536 -1.141769 -0.764104
H  3.733041 -0.864898 0.045439
H  0.675146 -0.077128 1.99318
H  0.508862 1.582921 1.408606
H  -2.339752 -1.166945 -0.870298
H  -3.30923 -1.083689 0.655952
H  -4.325839 0.421342 -1.117234
H  -3.689072 1.404573 0.235457
H  -2.764704 1.27432 -1.299157
