program: Gaussian 09
title: 000272408
version: EM64L-G09RevD.01
frameworkgroup: C1[X(C15H14O2)]
method: RPBEPBE
basis: SDD
operation: Freq
keyword: #pfreq=noraman
keyword: PBEPBE/SDD
title: #p freq=noraman PBEPBE/SDD
converged: YES YES NO NO
title: Mulliken charges:
elementType: O O C C C C C C C C C C C C C C C H H H H H H H H H H H H H H
charge: -0.215454 -0.200827 -0.371136 -0.221451 -0.297771 0.361734 -0.467777 0.157867 0.168358 0.151770 -0.453603 -0.420142 0.337345 -0.417743 -0.443462 -0.209311 -0.815366 0.277108 0.266655 0.245348 0.250726 0.221789 0.221439 0.210720 0.243764 0.241342 0.234550 0.226786 0.229330 0.261796 0.225615
chargesum: 0.00000
title: Mulliken charges with hydrogens summed into heavy atoms:
elementType: O O C C C C C C C C C C C C C C C
charge: -0.215454 -0.200827 -0.094027 0.045204 -0.052424 0.361734 0.004737 0.157867 0.168358 0.151770 -0.021443 -0.176378 0.337345 -0.176400 -0.208912 0.017476 -0.098625
polarizability: 2.21267040e+02 1.17509896e+01 1.64499991e+02 4.45615563e+00 -9.56075866e+00 1.02916261e+02
1716.lowfreq: -12.6442 -6.1130 -0.0005 0.0002 0.0004 11.8297 52.4593 71.3773 92.2222
frequency: 52.3829 71.3337 92.1644 102.6982 157.4943 162.4418 214.8207 240.4815 268.6648 297.7188 331.7610 397.5515 421.8899 436.7189 465.5044 490.8053 535.2710 554.1591 559.2778 580.6916 598.9174 639.3016 678.3123 715.6296 757.0483 764.9653 780.9880 794.4351 834.0935 841.4622 869.6026 872.1073 892.5740 903.8711 911.8570 953.7597 982.7654 988.1367 1013.1045 1028.0688 1046.7971 1048.2688 1070.1830 1080.5850 1093.0521 1115.7410 1163.9664 1175.5564 1180.9402 1190.1382 1220.1018 1225.3368 1253.3184 1262.9137 1274.7490 1279.0560 1286.2809 1294.0766 1308.1598 1331.3494 1339.1467 1391.3179 1401.1434 1427.2775 1464.6575 1469.7010 1475.3445 1478.3285 1483.5618 1601.6081 1606.5979 1680.5676 1691.4728 2957.8803 2977.0063 2988.1415 3012.9942 3016.8061 3051.0057 3052.3584 3057.5331 3074.1950 3091.6421 3122.8657 3128.4519 3137.1891 3157.5700
redmass: 4.5781 5.3488 1.2858 2.0314 3.5481 6.0965 3.1497 3.6489 2.5281 2.9560 5.2303 3.9896 6.2860 4.5459 3.4831 4.1183 4.0143 4.6846 4.4242 5.2945 3.6955 5.1055 5.2504 2.7892 3.7923 2.5511 3.1285 1.7912 3.9344 1.9682 3.8896 2.5486 2.9990 1.3954 2.9455 2.8571 1.3518 1.8054 2.1724 2.4535 1.6727 2.6766 2.6480 1.7815 2.1275 2.1785 1.3297 1.3521 1.3860 1.8982 1.6869 1.6039 1.4968 1.4610 1.3547 1.5630 1.4680 2.1774 1.3551 1.9325 1.5949 3.6574 1.3895 2.7297 1.0892 1.0570 2.3734 1.0842 1.2721 7.3154 7.1989 8.6457 12.7728 1.0680 1.0387 1.0820 1.0634 1.0841 1.0919 1.0886 1.0954 1.1041 1.0996 1.0864 1.0933 1.0914 1.0991
irintensity: 2.7350 2.5463 0.8741 0.4202 0.7931 1.4107 1.8282 3.9148 1.0492 0.3182 4.3203 1.1417 5.3345 1.4875 1.7298 0.3645 1.6301 2.5736 1.5367 0.9504 3.1630 3.7152 3.9250 11.7680 8.8967 10.0753 2.2316 63.8284 14.1683 14.6261 106.0095 13.6712 5.1262 0.5385 4.2892 26.5710 0.5014 3.5072 6.8752 29.0107 12.1662 4.0106 97.8491 12.7606 53.9375 1.6542 5.5647 4.6790 0.2775 7.4703 2.5775 3.5768 3.6187 0.6531 1.7956 4.0821 6.1810 1.3637 4.3070 5.3771 4.5229 10.3453 13.4926 0.7632 5.5093 13.1532 8.3494 11.6718 25.8311 14.3384 10.0461 1.8049 324.3449 45.2709 24.9417 10.3085 29.1860 9.6915 58.6409 27.1040 11.0329 30.0317 19.4234 3.5220 15.5196 17.1870 31.7481
temp: 298.150 k
press: 1.00000 atm
elementType: 8 8 6 6 6 6 6 6 6 6 6 6 6 6 6 6 6 1 1 1 1 1 1 1 1 1 1 1 1 1 1
symmnumber: 1
zpe: 654906.2 jmol-1
zpe.correction: 0.249441 hartree
zpe.thermalcorrener: 0.262942 hartree
zpe.thermalcorrenthalpy: 0.263887 hartree
zpe.thermalcorrgfe: 0.209300 hartree
zpe.sumelectzpe: -729.247710 hartree
zpe.sumelectthermal: -729.234209 hartree
zpe.sumelectthermalent: -729.233265 hartree
zpe.sumelectthermalfe: -729.287851 hartree
dipole: -1.0352 3.1197 3.3664
dipole: 4.7049
quadrupole: -89.4391 -101.6764 -101.3099
quadrupole: 8.9940 8.0096 -11.5381
quadrupole: 8.0361 -4.2013 -3.8348 8.9940 8.0096 -11.5381
hfenergy: -729.497151 hartree
pointgroup: C01 [X(C15H14O2)]
dipole: 0.5369984 -1.2687131 1.2362965 debye
polarizability: 218.9326245|16.1996633|165.1220553|-8.6340135|12.0814933|104.6286128 unknown
InChI: InChI=1S/C15H14O2/c1-8-4-2-5-9-10-6-3-7-11-13(10)14(12(8)9)17-15(11)16/h2,4-6,11,13-14H,3,7H2,1H3
charge 0 multiplicity 1
31 atoms
O  -0.542253 1.986565 -0.104509
O  -2.594271 2.253648 -1.152924
C  -0.978202 -0.070625 1.128638
C  -2.324465 0.497423 0.615082
C  0.082304 1.048568 0.909896
C  -0.472994 -1.24532 0.292472
C  -3.247688 -0.546072 -0.088979
C  1.285758 0.338968 0.324246
C  0.945318 -0.999883 -0.026949
C  -1.900917 1.65142 -0.31748
C  -2.818282 -2.016525 0.2104
C  -1.346276 -2.204638 -0.119123
C  2.574844 0.870612 0.089047
C  1.910188 -1.8488 -0.615805
C  3.531934 0.002226 -0.498213
C  3.20553 -1.334193 -0.842298
C  2.913414 2.308884 0.433463
H  -1.040564 -0.357363 2.193934
H  -2.873419 0.966658 1.45565
H  0.297301 1.672264 1.793702
H  -3.212038 -0.382483 -1.180714
H  -4.295977 -0.390637 0.221879
H  -3.444481 -2.709175 -0.379769
H  -3.014057 -2.246865 1.279403
H  -1.028833 -3.049354 -0.742278
H  1.665056 -2.881448 -0.886177
H  4.54371 0.377119 -0.692859
H  3.973124 -1.973642 -1.293005
H  3.929604 2.572889 0.095715
H  2.198622 3.005821 -0.040106
H  2.866209 2.485956 1.525562
