program: Gaussian 09
title: 000272400
version: EM64L-G09RevD.01
frameworkgroup: C1[X(C13H8Br2N2O)]
method: RPBEPBE
basis: SDD
operation: Freq
keyword: #p
keyword: freq=noraman
keyword: PBEPBE/SDD
title: #p freq=noraman PBEPBE/SDD
converged: NO YES NO YES
title: Mulliken charges:
elementType: Br Br O N N C C C C C C C C C C C C C H H H H H H H H
charge: 0.006063 0.017842 -0.255871 -0.449973 -0.696720 0.268935 0.338016 0.355106 0.105535 -0.021524 -0.329747 -0.621090 -0.368042 -0.286530 0.755243 -0.599721 -0.188544 -0.242451 0.331989 0.236442 0.228750 0.228711 0.293761 0.251551 0.314216 0.328053
chargesum: 0.00000
title: Mulliken charges with hydrogens summed into heavy atoms:
elementType: Br Br O N N C C C C C C C C C C C C C
charge: 0.006063 0.017842 -0.255871 -0.117984 -0.054451 0.268935 0.338016 0.355106 0.105535 -0.021524 -0.093304 -0.392340 -0.139331 0.007231 0.755243 -0.599721 0.063008 -0.242451
polarizability: 3.83578068e+02 -4.71081743e+00 2.06240617e+02 -1.01522532e-02 -8.57287580e-03 6.70264946e+01
1716.lowfreq: -2.5080 -0.0005 -0.0005 -0.0003 4.2494 8.3530 43.1631 49.0222 82.1099
frequency: 43.1194 49.0054 82.1098 113.4877 147.8974 153.5087 156.9395 217.1668 235.7592 242.5920 269.9160 295.2268 324.7359 373.6477 396.5154 418.3915 432.8569 448.2007 459.4788 475.3715 491.9019 503.2257 530.3417 606.8836 620.7886 652.1901 681.2548 691.5084 711.6155 716.1977 742.1224 784.8835 789.1581 826.7070 830.0791 860.1676 885.0538 940.6912 967.2608 982.7396 996.5751 1049.4920 1073.4669 1091.2175 1155.3931 1217.1962 1235.0549 1259.9331 1284.2045 1291.3121 1340.6605 1367.5752 1382.7440 1398.3533 1417.5452 1458.0849 1476.0096 1527.5992 1541.3081 1576.9401 1601.2247 1623.2574 1631.4545 1645.1203 3122.3579 3148.4708 3167.3811 3168.7120 3174.4277 3515.7043 3545.1580 3691.0135
redmass: 7.1094 8.1743 21.5873 6.3931 4.5725 14.7665 7.2281 11.4377 15.1773 5.5756 4.8989 5.1791 7.1730 3.2552 6.5247 1.2503 3.0386 2.6145 6.4357 1.3472 4.6643 8.0723 3.3121 5.9616 7.1479 2.4868 7.3728 7.1153 6.1634 2.0403 1.8225 3.4217 7.0024 6.1091 1.5866 2.1287 1.6223 1.4302 1.3638 2.8676 7.4024 1.5913 1.8688 5.4649 1.5745 1.4881 1.8863 1.9269 2.4848 1.6815 5.1343 2.4119 6.5182 3.6803 6.3248 2.9532 4.3806 4.2773 7.6353 6.9371 6.9409 2.2046 3.0538 2.6031 1.0913 1.0880 1.0927 1.0915 1.0957 1.0764 1.0459 1.1033
irintensity: 1.0091 3.0938 0.0263 0.2234 1.8396 0.5742 2.1140 2.4935 1.7917 3.4504 1.6695 0.0010 1.9736 11.2127 24.1184 35.5171 26.7236 108.1020 4.7869 121.7075 10.4718 17.4429 3.1498 12.2052 0.1069 34.4427 0.5231 3.4071 13.4561 10.6497 44.8556 6.7329 51.6982 26.3532 22.7150 105.2569 5.7396 9.7274 1.4085 18.4594 22.9258 13.0908 6.1792 25.9524 4.5080 10.7059 12.5155 19.8658 77.1485 54.8023 137.4740 14.4164 56.5900 18.5112 7.2693 258.6786 32.8314 36.9159 13.4671 13.2585 57.0733 97.1763 336.3054 581.6912 14.7478 5.8595 2.4626 0.0576 10.1840 32.5793 152.5972 39.0745
temp: 298.150 k
press: 1.00000 atm
elementType: 35 35 8 7 7 6 6 6 6 6 6 6 6 6 6 6 6 6 1 1 1 1 1 1 1 1
symmnumber: 1
zpe: 474472.7 jmol-1
zpe.correction: 0.180717 hartree
zpe.thermalcorrener: 0.195904 hartree
zpe.thermalcorrenthalpy: 0.196849 hartree
zpe.thermalcorrgfe: 0.136587 hartree
zpe.sumelectzpe: -710.654106 hartree
zpe.sumelectthermal: -710.638919 hartree
zpe.sumelectthermalent: -710.637975 hartree
zpe.sumelectthermalfe: -710.698237 hartree
dipole: -6.4230 -0.0848 -0.0029
dipole: 6.4235
quadrupole: -114.0990 -116.3995 -128.1751
quadrupole: -22.7186 0.0256 -0.0043
quadrupole: 5.4589 3.1583 -8.6172 -22.7186 0.0256 -0.0043
hfenergy: -710.8348236 hartree
pointgroup: C01 [X(C13H8Br2N2O1)]
dipole: -2.5178956 -0.2167875 -0.0011251 debye
dipolederiv: -0.418956 -0.2562527 -0.0000472 -0.4105808 -0.4100676 -0.0000837 -0.0000585 -0.0000965 -0.0247866 -0.9243248 0.1452526 0.0001301 0.1312193 -0.071782 0.0000537 -0.0003565 -0.0000969 -0.0307128 -0.8515435 -0.3882667 -0.000182 -0.5394355 -1.2021593 -0.0002649 0.0004624 0.0005311 -0.3651156 -1.1751142 -0.5449173 0.0000693 -0.0930347 -0.4419823 -0.0000223 -0.0000987 0.000032 -0.2984769 -1.9338811 0.2633666 0.0007419 0.4114101 -0.2097136 -0.0000495 0.0022786 -0.0004173 -0.6900485 -0.6984598 -0.0488935 0.0000886 -0.0891267 -0.2978582 0.0000243 0.0000808 0.0000265 -0.0584949 0.9464619 -0.0044638 -0.000034 -0.3011291 0.0059216 0.000056 0.00016 -0.0000133 0.0444145 0.7640946 0.2098262 -0.0000212 0.2476892 0.6433748 0.0000788 -0.0000216 0.0000862 0.1321473 -0.1130655 0.172042 -0.0000106 -0.1122499 -0.4936735 -0.0000414 -0.0000678 -0.0002692 -0.0029159 1.4319172 0.4682407 0.0000922 0.2720689 1.4128809 0.0001991 -0.000451 -0.000339 0.1881648 0.464868 0.0799495 -0.0000456 -0.0132508 -0.0470992 -0.0000726 -0.0001262 0.0000323 -0.0257307 -0.6384219 0.0730375 0.000064 -0.401876 -0.0005306 0.0000889 -0.0004097 -0.0000243 -0.276923 -0.3156658 0.0762134 0.0000359 0.27158 0.0506564 0.0000278 0.0000093 -0.0000258 -0.1496075 -0.4263962 -0.0217836 0.0001273 0.2737648 0.0186848 -0.0000294 0.0000946 -0.0000249 -0.0417704 1.7412545 -0.4800082 -0.0005643 -0.6937969 0.0270595 0.0000333 -0.000648 -0.0000887 0.2020292 -0.0889452 0.4891257 0.0001546 1.4204522 0.5555571 0.000195 0.0005743 0.000331 -0.2264168 -0.2067108 0.0420463 0.0000297 0.0857294 0.1207728 0.000016 -0.0000053 0.0000483 -0.0746274 1.4797794 -0.238143 -0.0003361 -0.3929215 -0.1002048 0.0000356 0.0002191 0.0001697 -0.1523734 0.1066716 0.0126829 -0.0000307 -0.0022402 0.1821219 -0.0000082 0.0000109 -0.0000029 0.3141249 0.1325668 0.0679963 0.0000013 0.0402489 -0.0238767 -0.0000371 -0.0000621 -0.000083 0.139939 0.0084461 0.0184507 0.0000196 0.0566565 -0.1071609 -0.0000509 0.0000358 -0.0000655 0.1847897 -0.0015129 -0.1057561 0.0000014 -0.0691271 -0.016366 -0.0000379 -0.000142 0.0000042 0.146893 0.1034594 -0.0164687 -0.0000175 -0.0976566 0.0884277 -0.0000254 0.0000463 -0.000029 0.1553059 0.0686771 0.0588081 0.0000056 0.0719162 -0.0261832 -0.0000285 0.0000918 -0.0000442 0.1561445 0.251119 -0.0442312 -0.0001008 -0.1151979 0.1323092 0.0001626 -0.0007345 0.0003796 0.3803458 0.2936818 -0.0278536 -0.0001716 0.0488882 0.2108912 -0.0002193 -0.000882 -0.0000202 0.3737019 unknown
polarizability: 383.3251382|8.1842305|206.4935442|-0.0159012|0.0189867|67.0264972 unknown
InChI: InChI=1S/C13H8Br2N2O/c14-6-1-2-7-8-4-10(15)11(16)5-12(8)17-13(18)9(7)3-6/h1-5,17H,16H2
charge 0 multiplicity 1
26 atoms
Br -4.271267 -2.544779 -0.000587
Br 5.555248 -1.116271 -0.000551
O  1.890991 3.048844 0.000053
N  -0.236648 2.124085 0.000448
N  -4.856893 0.565145 0.000417
C  -0.662017 -0.280371 0.000136
C  0.785991 -0.509646 0.000081
C  -1.15475 1.064493 0.000255
C  1.674941 0.614012 0.00024
C  1.163692 2.008923 0.000775
C  -1.628273 -1.322681 -0.000088
C  -2.539155 1.341318 0.000144
C  1.370805 -1.810623 -0.000222
C  3.082962 0.440671 0.000015
C  -3.499139 0.296431 0.000052
C  -2.996347 -1.04619 -0.000134
C  2.763258 -1.989179 -0.000413
C  3.61214 -0.853879 -0.0003
H  -0.58433 3.087984 0.000466
H  -1.306453 -2.367226 -0.00027
H  -2.88673 2.381862 0.000251
H  0.736947 -2.70249 -0.000344
H  3.71189 1.335879 0.000164
H  3.190062 -2.996239 -0.000659
H  -5.199569 1.521387 -0.000535
H  -5.529658 -0.198557 -0.000792
