program: Gaussian 09
title: 000272398
version: EM64L-G09RevD.01
frameworkgroup: C1[X(C13H7NO3)]
method: RPBEPBE
basis: SDD
operation: Freq
keyword: #p
keyword: freq=noraman
keyword: PBEPBE/SDD
title: #p freq=noraman PBEPBE/SDD
converged: YES YES NO NO
title: Mulliken charges:
elementType: O O O N C C C C C C C C C C C C C H H H H H H H
charge: -0.150239 -0.194460 -0.210680 0.015647 0.183339 0.319551 0.202656 0.203866 -0.308618 0.256118 -0.430754 -0.354312 -0.414145 -0.355664 -0.209102 -0.233808 -0.222032 0.292556 0.312050 0.284502 0.283435 0.250111 0.237965 0.242020
chargesum: 0.00000
title: Mulliken charges with hydrogens summed into heavy atoms:
elementType: O O O N C C C C C C C C C C C C C
charge: -0.150239 -0.194460 -0.210680 0.015647 0.183339 0.319551 0.202656 0.203866 -0.308618 0.256118 -0.138198 -0.042263 -0.129643 -0.072229 0.041010 0.004157 0.019988
polarizability: 2.42533859e+02 1.73504854e+01 1.99233742e+02 -2.93972986e+00 1.80870073e-02 5.95288359e+01
1716.lowfreq: -0.0006 0.0006 0.0008 9.4174 12.2553 15.5030 39.7750 58.6151 110.5362
frequency: 39.7461 58.6073 110.5361 151.5173 183.5835 189.1880 237.9456 275.7602 277.8241 354.2805 379.8253 410.3478 444.4336 452.0593 488.7094 539.8949 558.7113 585.2685 624.9682 656.8573 665.3319 709.7939 721.6079 749.5128 762.5769 783.4107 803.1293 834.5274 855.1554 915.7860 936.5014 962.6516 982.9474 990.8868 1002.1530 1008.0644 1033.0639 1076.3440 1088.0368 1133.4981 1169.1775 1175.6260 1192.2188 1203.8634 1214.3669 1247.5854 1294.5268 1369.2775 1377.8103 1400.2137 1432.6000 1447.2212 1455.0084 1473.5339 1572.3894 1586.5799 1604.1632 1617.0959 1637.5525 3139.1779 3151.7451 3152.1543 3167.9900 3168.7629 3187.7670 3212.4672
redmass: 13.7062 7.3200 4.4497 6.8528 6.0096 7.2085 6.4357 6.5540 7.0279 7.7200 7.5056 3.7309 4.0933 5.9104 6.2734 7.6704 3.2464 6.6696 7.5728 6.4761 6.4781 5.1952 8.9288 1.7762 6.4919 2.1632 1.8177 8.6291 2.5293 1.4603 7.0894 1.4257 1.4387 7.1309 1.3867 1.3703 2.0875 2.0416 1.9594 3.5611 1.2908 1.5041 1.9059 2.2631 5.7973 2.6361 1.5650 5.8062 8.3597 3.2398 2.5053 2.6713 2.6126 6.2821 7.2161 6.7980 7.5759 7.7416 11.0989 1.0866 1.0915 1.0894 1.0944 1.0987 1.0969 1.0936
irintensity: 0.6522 7.3381 1.7539 0.1374 1.0453 3.3055 0.6851 2.7594 1.7589 0.5756 0.1088 1.3516 5.4586 1.8343 1.2656 1.3280 0.1531 0.9678 2.7496 8.0581 4.7416 7.2852 15.3544 106.7228 3.1784 16.0088 7.8057 10.8008 26.8881 0.3037 25.7737 0.7332 4.5469 3.0611 3.3601 0.0590 0.9631 10.2643 16.6894 2.1018 3.7481 9.6826 14.5972 72.9388 219.8650 66.2026 7.8274 70.7050 14.2540 50.5294 74.8296 2.5187 13.5618 3.8456 77.7302 15.2685 54.7337 51.8992 117.7929 1.9201 5.8245 1.3609 18.4119 14.3677 3.9151 6.4674
temp: 298.150 k
press: 1.00000 atm
elementType: 8 8 8 7 6 6 6 6 6 6 6 6 6 6 6 6 6 1 1 1 1 1 1 1
symmnumber: 1
zpe: 440739.7 jmol-1
zpe.correction: 0.167869 hartree
zpe.thermalcorrener: 0.180267 hartree
zpe.thermalcorrenthalpy: 0.181211 hartree
zpe.thermalcorrgfe: 0.128352 hartree
zpe.sumelectzpe: -778.785790 hartree
zpe.sumelectthermal: -778.773392 hartree
zpe.sumelectthermalent: -778.772448 hartree
zpe.sumelectthermalfe: -778.825307 hartree
dipole: -0.9350 0.8071 -0.1270
dipole: 1.2417
quadrupole: -88.6825 -101.2001 -99.0502
quadrupole: 22.7354 1.7193 0.7477
quadrupole: 7.6284 -4.8892 -2.7393 22.7354 1.7193 0.7477
hfenergy: -778.9536589 hartree
pointgroup: C01 [X(C13H7N1O3)]
dipole: 0.3501961 -0.3369974 -0.0492988 debye
dipolederiv: -0.5752536 0.2338601 -0.0011325 0.1793763 -0.9703852 0.0126492 0.0003798 0.0024305 -0.2949843 -0.8821616 0.1961984 -0.1802907 0.3059852 -0.5202412 0.0247921 -0.1887682 0.0123832 -0.2819359 -0.4638635 -0.088714 -0.1548506 -0.0005051 -0.6903034 -0.1312491 -0.1099882 -0.0823279 -0.2924569 1.1457852 -0.2122504 0.3782176 -0.6448069 1.3906126 0.1244585 0.327426 0.0692176 0.336399 0.6354038 -0.1910577 -0.0152673 0.3323143 0.1395835 -0.0039952 0.0253754 -0.0586535 0.0217147 -0.2554056 0.066706 0.0066304 -0.0407623 0.1555325 -0.0025481 0.0090054 0.0049048 -0.0125085 -0.6413416 -0.0124224 0.0041742 -0.3359704 -0.2988301 0.0041209 0.0063939 -0.0023676 0.0450891 -0.2820813 -0.2984876 0.0074044 -0.3668844 -0.513684 0.0146218 0.0138354 0.0073045 0.0412677 1.1963165 -0.0144275 -0.0119353 0.0257517 1.2486294 -0.0209881 -0.0059919 -0.0055333 0.1068585 -0.2642779 0.1599215 -0.0445348 0.3554954 -0.4056457 -0.0224622 -0.0316894 0.0040992 0.0391945 0.3139024 -0.038675 0.0033269 0.112084 0.1989739 -0.0030018 0.0005823 0.0013534 -0.0948179 -0.0807539 -0.2696867 -0.0053897 0.0118659 -0.1268281 -0.0036802 0.003781 0.0191693 -0.1021626 0.0657307 0.0261771 -0.0056704 -0.210992 0.0907172 0.001567 -0.0049559 -0.0018543 -0.112984 -0.0994924 0.0913551 0.0012426 -0.2680929 0.0716826 -0.0053417 -0.0281902 0.0537805 -0.0855303 -0.1418508 0.1560303 0.0053313 0.3589215 -0.0863514 0.0035419 -0.0024571 0.0102743 -0.1555842 -0.065602 0.1619202 -0.0064637 0.1516612 0.1711693 -0.0002828 -0.0276469 0.0017389 -0.1299514 0.1097314 0.0658688 -0.0086918 0.0592291 -0.092875 -0.002283 -0.0131171 0.0003366 -0.1484164 0.1153513 0.0535959 -0.0002168 0.0010527 0.0031626 0.0006857 -0.0003956 -0.0029481 0.1597044 0.1456761 0.0634559 0.0133824 0.0413759 0.0702048 0.003391 0.0064806 -0.0114372 0.1587523 0.0420693 0.0357952 0.0019755 0.091769 0.0256808 -0.00061 0.0007861 -0.0009732 0.1607113 0.0553767 0.0106713 0.0052205 0.0499255 0.1172837 0.0021738 -0.0072265 -0.0158254 0.1631829 -0.0243536 -0.0867985 -0.0020009 -0.0787273 0.0214009 -0.0008737 0.0053786 -0.0055866 0.1628772 0.0569188 -0.0533897 0.0035599 -0.0840588 -0.0817847 0.0033039 0.0055403 -0.0002475 0.1534365 -0.1058244 -0.0556463 0.005979 -0.0460075 0.0822951 0.0020101 0.0154621 0.0007615 0.1621443 unknown
polarizability: 244.2610465|14.8616629|197.4637951|4.0881486|0.4765863|59.5715954 unknown
InChI: InChI=1S/C13H7NO3/c15-13-9-5-2-1-4-8(9)12-10(13)6-3-7-11(12)14(16)17/h1-7H
charge 0 multiplicity 1
24 atoms
O  1.691632 -2.979331 0.029866
O  -3.450046 2.050396 -0.388117
O  -1.429047 2.645762 0.461652
N  -2.260162 1.761814 0.02316
C  -0.498608 -0.100322 0.040789
C  0.862643 0.541231 0.026099
C  -0.305879 -1.523347 0.034669
C  1.843094 -0.505094 0.00944
C  1.164632 -1.833135 0.026269
C  -1.848199 0.336433 0.01298
C  -1.348462 -2.455302 0.020362
C  1.305473 1.880396 0.010145
C  3.221299 -0.249519 -0.024325
C  -2.924493 -0.596971 -0.020122
C  -2.684103 -1.980368 -0.00703
C  2.70128 2.142523 -0.035629
C  3.655269 1.098755 -0.050066
H  -1.11444 -3.524767 0.023399
H  0.597944 2.707428 0.047999
H  3.930264 -1.08383 -0.033232
H  -3.942465 -0.200467 -0.055637
H  -3.525944 -2.678711 -0.020314
H  3.041577 3.183715 -0.051073
H  4.724238 1.334211 -0.078085
