program: Gaussian 09
title: 000272411
version: EM64L-G09RevD.01
frameworkgroup: C1[X(C16H23NO3)]
method: RPBEPBE
basis: SDD
operation: Freq
keyword: #p
keyword: freq=noraman
keyword: PBEPBE/SDD
title: #p freq=noraman PBEPBE/SDD
converged: YES YES NO NO
title: Mulliken charges:
elementType: O O O N C C C C C C C C C C C C C C C C H H H H H H H H H H H H H H H H H H H H H H H
charge: -0.216485 -0.141646 -0.256976 -0.170135 0.133792 0.250894 -0.457957 -0.452443 0.011902 0.112292 -0.471629 -0.415146 -0.411072 -0.394205 -0.216090 -0.441661 -0.443182 -0.180246 -0.232139 -0.684221 0.232957 0.209189 0.198837 0.231321 0.225050 0.237182 0.195173 0.250252 0.243402 0.195483 0.206607 0.186655 0.227617 0.240406 0.210923 0.218403 0.223199 0.204454 0.248356 0.211870 0.214504 0.223859 0.240652
chargesum: 0.00000
title: Mulliken charges with hydrogens summed into heavy atoms:
elementType: O O O N C C C C C C C C C C C C C C C C
charge: -0.216485 -0.141646 -0.256976 -0.170135 0.133792 0.250894 -0.015810 -0.022286 0.011902 0.112292 -0.009397 0.030279 0.027813 -0.000942 0.011527 0.009668 -0.001580 0.024208 0.228087 -0.005206
polarizability: 2.33252773e+02 -8.88129294e+00 1.73158902e+02 3.01046393e+00 4.03672777e-01 1.46547766e+02
1716.lowfreq: -15.5384 -0.0001 0.0002 0.0006 2.5413 10.7840 19.5179 42.8198 48.8007
frequency: 17.9554 42.7890 48.7945 62.2120 72.4728 89.7297 111.6867 139.4161 153.2954 192.1477 213.6386 221.4026 227.4090 238.1889 247.9384 267.1807 282.9968 293.5273 307.3642 321.8623 350.1572 411.2254 426.5724 430.6569 455.9511 465.8899 495.3881 545.4946 573.3186 598.2944 661.5761 691.1246 697.1853 729.3009 766.8577 782.5151 786.9479 808.0899 821.9539 826.7798 844.4940 860.2257 871.1716 904.5615 912.1078 932.5311 939.7583 951.6080 963.1016 977.6464 982.7994 1015.2183 1022.0169 1049.5852 1053.9971 1068.8946 1086.5996 1101.1958 1102.1807 1110.3105 1125.9393 1132.9841 1142.2584 1161.2119 1171.0286 1174.5144 1183.0714 1218.2635 1238.9317 1242.2855 1260.9457 1263.9298 1266.5252 1270.8959 1298.5951 1315.1066 1330.0399 1337.4812 1340.3540 1342.1359 1344.6914 1350.7104 1357.1854 1359.5254 1381.8602 1395.2271 1449.8152 1457.1883 1459.0993 1459.2355 1459.9077 1461.8078 1468.9918 1473.4840 1474.0838 1481.3799 1487.9158 1610.9113 1660.9385 1670.2507 2957.3926 2963.0737 2971.1193 2976.4548 2989.2605 2990.8054 2991.9730 2994.2796 2997.0948 3001.7719 3017.7829 3028.8705 3032.5694 3036.2230 3053.5618 3055.7442 3062.1599 3067.3828 3070.2104 3092.5013 3093.4544 3106.4834 3124.1945
redmass: 4.8352 3.1704 4.6284 2.9936 3.5848 2.0853 3.1943 3.7556 4.0995 3.4125 1.8044 3.6522 1.9505 2.1474 2.5821 2.3218 4.7363 4.2419 3.7175 4.5994 1.8343 3.2631 3.3923 3.1996 2.9637 3.8576 2.0532 4.4535 5.4036 4.3947 1.9863 7.2175 4.2871 2.0278 2.7569 3.4131 1.5151 3.0109 1.6597 1.2827 2.4209 2.9401 1.7602 2.6923 2.6729 2.2297 1.4730 2.2646 2.3346 1.3277 2.9968 2.9666 3.4074 2.2571 2.0624 2.6145 1.7518 1.7521 1.6857 2.4294 1.6833 1.8180 1.5280 2.8594 2.2843 1.8584 1.6749 1.7097 1.4222 1.1914 2.3575 1.3514 1.3657 1.2041 2.0818 1.2946 1.3319 1.3516 1.4147 1.5536 1.4102 1.4118 1.3064 1.4088 1.5220 1.2519 1.0894 1.0808 1.0428 1.0836 1.0839 1.0887 1.0856 1.0865 1.0955 1.0555 1.0836 10.4941 7.9131 9.9127 1.0647 1.0636 1.0587 1.0593 1.0622 1.0604 1.0636 1.0466 1.0472 1.0660 1.0904 1.1026 1.0967 1.1022 1.1023 1.1013 1.1015 1.1062 1.1028 1.0836 1.0986 1.1025 1.0989
irintensity: 1.8182 0.6856 1.0384 0.0251 1.8400 1.9584 0.4854 0.0125 1.8789 5.9919 0.9433 1.0444 0.4541 1.2602 2.5368 0.2384 8.2863 6.0228 5.1100 1.1274 0.8454 3.3046 3.4987 0.3697 1.9682 5.7734 6.1447 6.6927 9.0124 6.8274 17.4867 2.6281 3.6941 10.3080 9.1118 13.6967 0.2211 7.0912 8.6850 3.8225 1.5839 3.7781 16.4748 3.4305 38.3419 16.8659 9.7233 8.1438 45.5148 3.5706 25.6132 67.9747 12.5209 1.8352 0.8022 1.1332 3.3279 1.4164 1.0167 8.8840 14.0127 21.0966 1.7453 3.4775 64.5665 35.1963 7.3597 0.6329 30.0595 1.3165 44.9335 2.6060 1.4061 2.6046 76.2183 0.0644 0.9706 1.3892 0.1055 3.7713 1.2691 0.4786 6.7492 1.5542 3.2964 30.0921 12.8230 2.1480 15.1467 7.4671 14.2821 6.1561 36.2493 18.7736 5.4256 4.1832 9.9271 325.4582 25.4014 55.0795 34.5157 41.1940 17.2328 17.6175 54.0846 7.3594 45.0156 24.9750 23.7169 28.8440 45.2939 33.6497 64.9384 12.5020 7.7843 20.1809 55.0738 6.8519 27.4967 4.9307 27.3216 32.5279 34.6314
temp: 298.150 k
press: 1.00000 atm
elementType: 8 8 8 7 6 6 6 6 6 6 6 6 6 6 6 6 6 6 6 6 1 1 1 1 1 1 1 1 1 1 1 1 1 1 1 1 1 1 1 1 1 1 1
symmnumber: 1
zpe: 953318.2 jmol-1
zpe.correction: 0.363100 hartree
zpe.thermalcorrener: 0.382833 hartree
zpe.thermalcorrenthalpy: 0.383777 hartree
zpe.thermalcorrgfe: 0.314361 hartree
zpe.sumelectzpe: -902.336128 hartree
zpe.sumelectthermal: -902.316395 hartree
zpe.sumelectthermalent: -902.315451 hartree
zpe.sumelectthermalfe: -902.384866 hartree
dipole: 2.4556 0.0728 1.4642
dipole: 2.8599
quadrupole: -107.8348 -129.0728 -115.6659
quadrupole: 2.5749 1.1636 6.8189
quadrupole: 9.6897 -11.5483 1.8586 2.5749 1.1636 6.8189
hfenergy: -902.6992275 hartree
pointgroup: C01[X(C16H23N1O3)]
dipole: 0.9721453 0.0327039 0.5655576 debye
polarizability: 233.3836245|-8.6161152|173.0828487|2.065082|0.5163733|146.4929676 unknown
InChI: InChI=1S/C16H23NO3/c1-2-20-17-14(19)15(9-5-3-6-10-15)13(18)16(17)11-7-4-8-12-16/h7,11H,2-6,8-10,12H2,1H3
charge 0 multiplicity 1
43 atoms
O  1.533301 1.646408 -0.598404
O  -0.53185 -2.678503 0.237865
O  -1.322638 2.045669 -0.480368
N  0.562996 0.649276 -0.25256
C  -1.525968 -0.423474 0.001503
C  1.011857 -0.757955 -0.043142
C  -2.511076 -0.813901 -1.152014
C  -2.296182 -0.39067 1.368596
C  -0.384597 -1.445354 0.088775
C  -0.802966 0.910254 -0.282256
C  1.781829 -1.3529 -1.260092
C  -3.77631 0.071565 -1.181608
C  -3.560634 0.495959 1.317137
C  -4.510108 0.055403 0.179239
C  1.802802 -0.899458 1.252209
C  3.293762 -1.042115 -1.208267
C  3.927869 -1.624567 0.074157
C  3.098329 -1.303933 1.301042
C  1.663216 2.670337 0.498643
C  2.716176 3.658641 0.007162
H  -2.790546 -1.873847 -0.988247
H  -1.983856 -0.75999 -2.124196
H  -1.616288 -0.0437 2.171769
H  -2.576547 -1.436824 1.604865
H  1.333936 -0.963854 -2.192702
H  1.624926 -2.448992 -1.23949
H  -4.447222 -0.292119 -1.984192
H  -3.490499 1.110121 -1.430432
H  -3.266655 1.550294 1.158852
H  -4.077156 0.436637 2.295087
H  -5.391062 0.724031 0.141823
H  -4.887875 -0.967981 0.386694
H  1.259786 -0.666618 2.178399
H  3.437572 0.053014 -1.230442
H  3.789417 -1.463999 -2.102613
H  4.956559 -1.236452 0.208162
H  4.029564 -2.727577 -0.014128
H  3.582207 -1.410572 2.282252
H  0.676693 3.147114 0.636301
H  1.973092 2.15019 1.425026
H  2.862716 4.452973 0.761387
H  3.684961 3.157403 -0.163014
H  2.393273 4.131963 -0.935572
