program: Gaussian 09
title: 000272371
version: EM64L-G09RevD.01
frameworkgroup: C1[X(C10H12O3)]
method: RPBEPBE
basis: SDD
operation: Freq
keyword: #pfreq=noraman
keyword: PBEPBE/SDD
title: #p freq=noraman PBEPBE/SDD
converged: NO NO NO NO
title: Mulliken charges:
elementType: O O O C C C C C C C C C C H H H H H H H H H H H H
charge: -0.269462 -0.290457 -0.234528 0.364986 -0.458221 0.357899 -0.386133 -0.241762 -0.420844 -0.167254 -0.686671 0.267928 -0.756912 0.322576 0.252489 0.214452 0.214303 0.255981 0.230984 0.209032 0.231217 0.231183 0.249835 0.249808 0.259572
chargesum: 0.00000
title: Mulliken charges with hydrogens summed into heavy atoms:
elementType: O O O C C C C C C C C C C
charge: -0.269462 -0.290457 -0.234528 0.364986 -0.135646 0.357899 -0.133644 0.186993 -0.164863 0.063730 -0.015238 0.267928 0.002303
polarizability: 1.59845512e+02 -1.89362211e+00 1.42840668e+02 -2.51617160e-04 -2.86772759e-02 6.29493639e+01
1716.lowfreq: -77.7367 -7.0619 -4.0396 -0.0004 0.0005 0.0008 6.1622 37.5567 65.7518
frequency: -77.7235 37.1691 65.6931 82.0028 92.5564 117.0426 184.6198 228.0910 247.8348 259.6041 282.9173 323.9642 352.6214 437.6910 454.3070 506.2972 558.8615 578.2741 604.5422 650.6273 688.3262 702.0191 789.5486 822.8800 824.1799 883.8564 884.6190 894.8531 962.6349 970.0486 980.7784 1003.5490 1033.6183 1044.9775 1078.0100 1114.5764 1124.4177 1134.1110 1165.3591 1174.7404 1241.0304 1262.7235 1295.9824 1366.1959 1383.9013 1390.6198 1400.2131 1428.7681 1453.5298 1457.0041 1461.4707 1469.5011 1480.2463 1491.7014 1591.4316 1609.3689 1645.5779 2961.9871 2996.8788 3008.7051 3021.6304 3093.6602 3095.2276 3106.7086 3143.8598 3145.6843 3169.8788 3181.1966 3217.8969
redmass: 1.0321 5.9335 3.3047 3.3793 4.0386 1.9668 4.3872 2.3665 1.6670 5.0005 3.6622 4.8175 4.7875 4.0285 3.1163 4.3999 3.3309 5.9782 4.9122 6.1614 2.1064 6.4834 1.4558 1.1175 4.5994 4.4153 1.4424 1.3968 3.7009 1.3180 5.9885 1.8940 2.6379 1.6033 1.5175 1.9531 2.1769 1.4373 1.1138 3.7450 5.7413 1.1412 1.3087 1.3848 1.2295 4.3709 1.3790 3.1717 1.0653 1.0458 1.0400 1.7100 1.1916 1.1828 6.3650 7.2867 10.8665 1.0556 1.0363 1.0367 1.1076 1.0987 1.0972 1.1015 1.0874 1.1009 1.0929 1.0985 1.0915
irintensity: 0.8886 5.1184 0.8859 0.0031 1.8146 5.3212 2.3724 0.0355 1.5637 0.0032 3.5570 1.4673 2.0866 0.2903 3.4343 12.8922 1.5404 6.1749 0.1514 7.1639 25.6419 1.7286 56.3319 17.9074 6.4649 35.6666 4.2227 34.1623 71.6078 1.6350 8.6981 87.3921 59.8663 9.7412 16.7253 17.9419 110.7436 4.5941 0.3901 465.0009 224.8170 0.0609 10.9738 13.2505 51.4859 8.4375 49.6245 27.5632 20.9979 17.9818 11.8647 120.8149 30.0746 1.7365 112.2173 50.2759 224.9589 30.4277 24.7102 3.6278 30.7949 26.7106 6.3234 35.9345 11.9631 6.9160 7.1890 6.5809 9.0323
temp: 298.150 k
press: 1.00000 atm
elementType: 8 8 8 6 6 6 6 6 6 6 6 6 6 1 1 1 1 1 1 1 1 1 1 1 1
symmnumber: 1
zpe: 519863.6 jmol-1
zpe.correction: 0.198006 hartree
zpe.thermalcorrener: 0.210483 hartree
zpe.thermalcorrenthalpy: 0.211427 hartree
zpe.thermalcorrgfe: 0.158165 hartree
zpe.sumelectzpe: -612.957995 hartree
zpe.sumelectthermal: -612.945517 hartree
zpe.sumelectthermalent: -612.944573 hartree
zpe.sumelectthermalfe: -612.997835 hartree
dipole: 1.0238 -0.2402 0.0087
dipole: 1.0516
quadrupole: -63.9199 -72.5318 -78.6577
quadrupole: 3.1278 0.0101 -0.0406
quadrupole: 7.7833 -0.8287 -6.9546 3.1278 0.0101 -0.0406
hfenergy: -613.1560001 hartree
pointgroup: C01 [X(C10H12O3)]
dipole: -0.3995473 -0.1023786 -0.0325021 debye
dipolederiv: -1.2082457 0.7091537 -0.0964239 0.8146567 -0.9907737 0.0876217 -0.1004306 0.0797388 -0.2972631 -1.1690918 -0.630459 -0.0599398 -0.9580996 -1.3734361 -0.0386126 -0.0497281 -0.0125916 -0.1856301 -0.6151408 0.3474406 -0.0373364 -0.2587452 -1.0071142 0.0027296 -0.0163567 0.0520818 -0.3157852 1.209767 -0.7615311 0.1127331 -0.6352553 0.5090983 -0.0637165 0.1092023 -0.0747365 0.1207182 -0.6145926 0.1820393 -0.0381349 -0.1067928 -0.1843102 -0.0093078 -0.0293064 0.0141452 -0.2158595 1.0159915 0.4174256 0.0592286 0.4020037 0.6118936 0.0171974 0.0604929 0.0189277 0.1169865 -0.2036917 0.0744706 -0.0024071 0.3850959 -0.2701066 0.0333812 -0.0118328 0.0084578 -0.2018338 0.3560857 -0.1309943 0.0015317 -0.5319377 0.8566321 -0.0573586 0.0140973 -0.0249876 0.3874034 -0.2753065 -0.0979437 -0.0014342 -0.2121844 -0.3075382 -0.0143027 0.0020303 -0.0052822 -0.2182083 0.2865251 0.0232301 0.0332981 -0.0043885 0.1756083 -0.0098277 0.0342124 -0.0076442 -0.1326311 -0.0882265 0.0787294 -0.0145346 0.1141035 0.0030851 0.0111232 -0.0154898 0.0081067 0.0570665 1.2459771 0.0153809 0.0852292 1.0032589 1.976517 0.0223895 0.0524787 -0.0574042 0.2245886 -0.4351527 -0.1117124 -0.0334857 -0.19851 -0.0693481 -0.0136344 -0.0307859 -0.0065614 0.0109185 0.2028657 0.0220309 0.0007178 0.0614946 0.0420112 0.0091277 -0.0007766 0.0061364 0.1861406 -0.0362824 -0.0743693 -0.0149299 -0.0635426 0.0752098 -0.0020975 -0.0155125 -0.0029628 0.1747817 -0.0246944 -0.0669824 0.1124814 0.0680148 -0.0568932 0.0363165 0.094532 0.0630645 -0.0691092 0.0078694 -0.0617397 -0.0963203 0.0679616 -0.0634799 -0.0269026 -0.0862477 -0.0754653 -0.0959689 -0.0247905 0.0726276 -0.019189 0.0690349 0.0753245 0.0089054 -0.019091 0.0092913 0.1841223 0.0794046 -0.0072146 -0.0058656 -0.0109767 -0.130315 0.0078063 -0.0057041 0.0080547 0.1542205 0.0567081 0.0099253 -0.005128 0.0601496 -0.1655387 0.0130536 -0.0066696 0.0089587 0.1134649 0.0069525 -0.0101078 0.0782889 -0.0794717 0.0945544 0.0677367 0.1106596 0.051785 -0.0502664 0.0358803 -0.0047208 -0.0639188 -0.0720493 0.0866581 -0.0892179 -0.092383 -0.061898 -0.0717031 0.0568593 -0.0282263 0.0182835 -0.0183972 0.077688 0.0900331 0.0657427 0.0893635 -0.0026178 0.0686971 -0.0133459 -0.0057654 -0.0066393 0.0649096 -0.0971945 -0.0539153 -0.0979454 -0.0017185 0.0656322 0.0468933 -0.0069788 0.111216 -0.030336 0.0147509 -0.0092181 0.0093669 0.1281831 unknown
polarizability: 159.1488009|2.4154017|142.8434907|7.698263|-2.299755|63.6432523 unknown
InChI: InChI=1S/C10H12O3/c1-3-12-9-5-4-6-10(7-9)13-8(2)11/h4-7H,3H2,1-2H3
charge 0 multiplicity 1
25 atoms
O  2.684749 -0.100029 0.206451
O  -2.293994 0.081749 -0.201732
O  -1.794609 -2.222737 -0.082674
C  1.446741 0.544205 0.085645
C  0.209725 -0.1462 0.006471
C  -0.970693 0.624614 -0.111516
C  1.498273 1.95992 0.046719
C  2.698942 -1.579305 0.252955
C  -0.946762 2.033903 -0.152393
C  0.300881 2.691175 -0.072105
C  4.159095 -2.00119 0.388109
C  -2.621146 -1.290561 -0.182502
C  -4.121204 -1.453561 -0.302355
H  0.148086 -1.232838 0.033747
H  2.471366 2.45514 0.110687
H  2.095629 -1.925117 1.116759
H  2.245586 -1.980277 -0.676284
H  -1.886441 2.584744 -0.244815
H  0.336597 3.785196 -0.102367
H  4.230812 -3.103577 0.425935
H  4.750293 -1.641177 -0.470904
H  4.600432 -1.589848 1.31174
H  -4.497246 -2.004509 0.577347
H  -4.349107 -2.065323 -1.192661
H  -4.626606 -0.481195 -0.378056
