program: Gaussian 09
title: 000272399
version: EM64L-G09RevD.01
frameworkgroup: C1[X(C16H11NO4S2)]
method: RPBEPBE
basis: SDD
operation: Freq
keyword: #p
keyword: freq=noraman
keyword: PBEPBE/SDD
title: #p freq=noraman PBEPBE/SDD
converged: YES YES NO NO
title: Mulliken charges:
elementType: S S O O O O N C C C C C C C C C C C C C C C C H H H H H H H H H H H
charge: 0.182538 0.125280 -0.135761 -0.141175 -0.205103 -0.196693 0.021167 0.386579 0.298631 0.229948 0.241456 -0.310700 -0.348025 -0.341246 -0.563100 -0.416654 0.411332 -0.206173 -0.390432 -0.221185 -0.369886 -0.241633 -0.669548 0.272336 0.331226 0.288946 0.259082 0.290794 0.246826 0.240692 0.232528 0.216467 0.240196 0.241292
chargesum: 0.00000
title: Mulliken charges with hydrogens summed into heavy atoms:
elementType: S S O O O O N C C C C C C C C C C C C C C C C
charge: 0.182538 0.125280 -0.135761 -0.141175 -0.205103 -0.196693 0.021167 0.386579 0.298631 0.229948 0.241456 -0.310700 -0.348025 -0.068911 -0.231875 -0.127707 0.411332 0.052909 -0.099638 0.025641 -0.369886 0.231588 0.028407
polarizability: 3.20787136e+02 -1.52753484e+01 3.03221402e+02 2.36082132e+01 1.09744771e+01 1.39974486e+02
1716.lowfreq: -0.0013 0.0016 0.0017 3.9548 5.7728 8.4292 18.5204 20.8045 34.9733
frequency: 18.3959 20.7262 34.9481 53.2842 60.0559 65.0027 94.4283 105.0302 120.6411 131.4607 153.0508 173.0534 184.7729 212.4992 235.2410 238.1483 277.0247 293.7244 309.0157 321.6450 351.1752 392.0603 419.6463 440.6550 452.8919 490.7197 496.8136 502.2388 510.9138 529.3930 541.0702 554.3588 577.3175 653.8077 665.7448 669.9129 708.8319 739.8382 777.5441 779.0853 796.4497 799.1755 813.4320 826.7163 850.8916 873.2139 936.7240 946.4776 955.3328 969.7839 997.8958 998.9592 1001.6663 1002.9786 1058.0957 1070.3729 1106.2243 1115.2778 1116.8505 1125.0556 1162.0509 1186.6078 1191.1016 1206.6681 1217.5493 1242.9980 1254.1247 1267.0462 1356.7688 1360.9878 1378.2622 1393.3287 1404.2270 1422.1995 1442.2333 1449.0497 1460.3576 1465.0819 1478.5417 1482.8454 1576.1228 1591.3420 1600.6415 1615.3337 1640.3123 2994.6710 3003.0421 3064.0668 3099.4617 3117.0355 3147.1043 3159.3130 3174.1732 3174.6666 3179.2876 3190.8425
redmass: 11.3474 4.6329 7.8101 12.2097 6.8672 2.0478 7.3718 4.0446 11.7109 4.7477 6.2083 5.7771 12.3051 5.9791 1.3348 3.5548 9.7806 7.4788 7.3778 6.4176 7.6203 7.0561 4.0896 5.9017 5.2886 8.2777 11.5513 7.9147 7.1715 5.6038 6.3102 3.6388 7.1695 8.5771 6.6003 7.3351 4.8675 8.9940 1.6204 7.0299 4.6714 3.6495 1.0951 8.1644 3.0390 1.5372 6.2284 1.4949 6.4289 1.5816 4.7234 1.4597 1.4420 2.1195 2.1167 1.7502 3.6520 1.4229 2.3625 1.8605 1.8965 1.6491 6.2039 3.9675 3.7774 2.3479 1.1641 1.5302 1.3752 8.1541 5.1864 3.6211 1.2422 2.9054 4.0271 3.0132 1.0385 1.0803 5.7673 1.0558 7.5367 8.3366 8.1576 8.0493 11.6477 1.0542 1.0381 1.1084 1.0985 1.1024 1.0871 1.0928 1.0894 1.0995 1.0934 1.0963
irintensity: 1.8389 0.6184 0.3815 0.0930 0.1022 0.6343 6.8996 2.5370 0.3513 0.0773 1.7002 1.5507 1.3496 4.1804 0.4342 2.4867 3.5441 0.0951 1.9347 1.3075 3.6171 5.6769 2.2117 18.1958 5.1567 3.5353 1.3698 7.1880 21.1637 7.5772 3.6394 0.6416 3.7674 4.6495 3.6476 5.1238 21.7787 21.1794 59.2541 17.6049 25.4556 6.0177 4.7530 12.6816 0.4588 16.5803 231.1161 18.5570 86.1114 18.6122 10.7374 3.3854 1.2288 53.6704 44.9630 8.9870 9.8501 10.1749 34.8107 33.0764 5.4845 38.2678 472.5822 183.2627 315.5769 5.4041 0.5159 5.0594 3.3940 78.2200 13.5948 33.0521 20.6805 24.9085 6.6200 17.3137 13.3894 15.5536 11.6820 12.2504 7.7520 56.8371 31.6869 135.8485 154.8372 18.2823 16.8784 10.0518 18.6432 25.0805 0.9619 0.9355 1.1585 15.7088 6.7103 0.9714
temp: 298.150 k
press: 1.00000 atm
elementType: 16 16 8 8 8 8 7 6 6 6 6 6 6 6 6 6 6 6 6 6 6 6 6 1 1 1 1 1 1 1 1 1 1 1
symmnumber: 1
zpe: 615282.4 jmol-1
zpe.correction: 0.234349 hartree
zpe.thermalcorrener: 0.255243 hartree
zpe.thermalcorrenthalpy: 0.256187 hartree
zpe.thermalcorrgfe: 0.181459 hartree
zpe.sumelectzpe: -1766.374939 hartree
zpe.sumelectthermal: -1766.354045 hartree
zpe.sumelectthermalent: -1766.353100 hartree
zpe.sumelectthermalfe: -1766.427829 hartree
dipole: -8.5179 1.1596 -3.8995
dipole: 9.4396
quadrupole: -160.8899 -140.7524 -152.3148
quadrupole: 11.9573 9.0060 2.9145
quadrupole: -9.5709 10.5666 -0.9957 11.9573 9.0060 2.9145
hfenergy: -1766.6092879 hartree
pointgroup: C01 [X(C16H11N1O4S2)]
dipole: -3.3287753 -0.4922838 1.5713979 debye
polarizability: 320.0626525|16.0075875|302.6877548|-25.8376483|14.2902722|141.2326156 unknown
InChI: InChI=1S/C16H11NO4S2/c1-2-21-16(22)23-13-5-3-4-11-14(13)10-7-6-9(17(19)20)8-12(10)15(11)18/h3-8H,2H2,1H3
charge 0 multiplicity 1
34 atoms
S  -2.878464 -0.126702 1.055047
S  -2.70322 0.060911 -2.102732
O  2.67424 -3.057564 -0.536621
O  -4.210693 1.627478 -0.567684
O  3.652408 3.615176 0.182055
O  5.016216 1.860105 -0.335826
N  3.864183 2.359567 -0.036296
C  -0.441095 -1.436973 0.306252
C  0.505776 -0.28592 0.27198
C  1.806829 -0.783829 -0.055263
C  0.292532 -2.626667 -0.004435
C  1.733546 -2.27344 -0.243998
C  -1.822005 -1.551237 0.565993
C  0.324355 1.094445 0.49244
C  2.922709 0.050337 -0.166142
C  -0.306112 -3.892428 -0.058679
C  2.711908 1.431138 0.064644
C  -2.438619 -2.829924 0.519038
C  1.44048 1.956739 0.388589
C  -1.693949 -3.990372 0.208403
C  -3.319544 0.589259 -0.642774
C  -4.824198 2.080584 0.732705
C  -5.765325 3.224316 0.377436
H  -0.657021 1.501102 0.743967
H  3.914365 -0.33464 -0.418368
H  0.296141 -4.773258 -0.302906
H  -3.51155 -2.905994 0.720737
H  1.343462 3.03346 0.551775
H  -2.197883 -4.961288 0.174156
H  -5.355879 1.220419 1.180053
H  -4.009586 2.404313 1.407553
H  -6.252485 3.600652 1.295118
H  -5.214474 4.056416 -0.091581
H  -6.549048 2.885417 -0.320134
