program: Gaussian 09
title: 000272380
version: EM64L-G09RevD.01
frameworkgroup: C1[X(C14H6ClNO4)]
method: RPBEPBE
basis: SDD
operation: Freq
keyword: #p
keyword: freq=noraman
keyword: PBEPBE/SDD
title: #p freq=noraman PBEPBE/SDD
converged: NO YES NO NO
title: Mulliken charges:
elementType: Cl O O O O N C C C C C C C C C C C C C C H H H H H H
charge: -0.076828 -0.130678 -0.075302 -0.197959 -0.192215 0.022531 0.212083 0.307074 0.215671 0.220851 -0.305510 0.334725 -0.319820 -0.559156 -0.404841 0.412943 -0.392972 -0.345289 -0.217455 -0.225021 0.273061 0.332906 0.293210 0.296115 0.267488 0.254388
chargesum: 0.00000
title: Mulliken charges with hydrogens summed into heavy atoms:
elementType: Cl O O O O N C C C C C C C C C C C C C C
charge: -0.076828 -0.130678 -0.075302 -0.197959 -0.192215 0.022531 0.212083 0.307074 0.215671 0.220851 -0.305510 0.334725 -0.046759 -0.226250 -0.111630 0.412943 -0.096858 -0.077801 0.036933 -0.225021
polarizability: 3.00489632e+02 1.93347507e+01 2.17787145e+02 -1.25620278e+01 9.10506127e+00 8.44983269e+01
1716.lowfreq: -4.4928 -0.0018 -0.0017 -0.0016 3.4484 5.7457 43.1565 47.0482 56.0497
frequency: 43.1463 47.0392 56.0437 62.5684 103.2936 137.6218 153.1073 163.4965 174.5745 226.6270 275.4197 282.3330 304.4735 321.3862 350.9351 410.7446 427.4485 448.9152 472.5261 493.9666 506.5365 548.5640 555.3350 580.0055 631.9563 646.8650 671.4097 680.7418 712.6967 734.5672 742.8913 776.4484 801.1511 811.2713 853.8490 865.9237 894.2951 951.1879 969.4946 972.3893 995.9988 998.9042 1002.1689 1060.5592 1080.3528 1122.7365 1166.3339 1178.5688 1204.7358 1217.3484 1221.1272 1248.2732 1272.2908 1363.4747 1382.8101 1393.7436 1427.0431 1442.7970 1455.4287 1476.9728 1581.4867 1595.3341 1602.6604 1613.7104 1642.2445 1723.1784 3150.2745 3160.0325 3176.7870 3177.2618 3178.9394 3193.4810
redmass: 12.6206 14.8563 9.1773 10.5465 13.3193 10.0103 5.9068 7.8962 6.0468 8.1582 10.3726 6.5779 7.7761 8.4463 7.3144 9.1768 4.1531 4.8256 8.0705 6.7418 8.4271 3.6775 5.7677 7.1991 7.7175 8.7676 6.9860 6.5047 4.9348 6.3622 9.3634 1.8492 3.5280 8.1521 2.7936 1.5843 6.6530 1.3900 1.6104 5.3483 1.7592 3.0907 1.4448 2.0592 1.7550 2.3998 1.8991 1.5984 4.2345 3.7484 3.8630 2.3341 1.4859 7.3684 7.5056 2.9189 3.2710 4.0685 2.8009 4.7947 8.0033 7.9360 7.5156 7.7904 11.8018 13.1111 1.0875 1.0929 1.0897 1.0997 1.0936 1.0964
irintensity: 1.7437 0.2326 1.2785 2.2477 1.7540 3.2320 0.6616 2.7866 2.7695 0.1887 3.8268 3.5567 2.1322 3.8157 1.2586 21.7323 1.6005 4.1255 0.7123 14.7483 3.7789 1.5529 3.9827 1.5202 28.5033 24.0004 3.0934 2.1235 11.2420 86.0439 52.5125 47.4994 3.9646 11.7498 0.6906 23.2771 66.4299 1.2433 27.2789 24.0077 3.8210 11.3899 3.2444 55.8305 6.5021 11.4011 15.3128 13.7436 241.6132 235.8501 55.1983 14.8724 3.0339 70.9569 30.2807 27.2147 18.4577 7.4869 26.5923 5.4512 54.9415 0.5266 7.1162 135.9192 152.4495 306.5814 0.2141 0.0926 1.4329 10.1793 7.6894 1.2150
temp: 298.150 k
press: 1.00000 atm
elementType: 17 8 8 8 8 7 6 6 6 6 6 6 6 6 6 6 6 6 6 6 1 1 1 1 1 1
symmnumber: 1
zpe: 438851.9 jmol-1
zpe.correction: 0.167150 hartree
zpe.thermalcorrener: 0.182971 hartree
zpe.thermalcorrenthalpy: 0.183915 hartree
zpe.thermalcorrgfe: 0.122357 hartree
zpe.sumelectzpe: -1351.373083 hartree
zpe.sumelectthermal: -1351.357261 hartree
zpe.sumelectthermalent: -1351.356317 hartree
zpe.sumelectthermalfe: -1351.417876 hartree
dipole: 5.8330 1.2373 -0.5743
dipole: 5.9904
quadrupole: -136.2850 -129.1248 -122.1462
quadrupole: 14.1551 1.1840 -1.4453
quadrupole: -7.0996 0.0606 7.0391 14.1551 1.1840 -1.4453
hfenergy: -1351.5402324 hartree
pointgroup: C01 [X(C14H6Cl1N1O4)]
dipole: 2.3292858 -0.2720986 0.2342466 debye
dipolederiv: -0.2543021 0.185507 -0.3017102 0.0148555 -0.4762345 0.2974695 -0.1632968 0.3686785 -0.6802855 -0.4985565 -0.1426547 -0.0033747 -0.0445678 -0.9765563 -0.0560778 -0.0162867 -0.0497898 -0.2843769 -0.5274171 -0.1961588 -0.4205073 -0.3811985 -0.6728393 -0.2655089 -0.308873 -0.0386607 -0.7263336 -0.8396951 0.2255553 0.0197828 0.2946921 -0.6586715 -0.0471079 0.0277955 -0.0449969 -0.224017 -0.8426133 -0.1522 -0.0196065 -0.2516005 -0.59497 -0.0426086 -0.0270967 -0.0391856 -0.2221644 2.1620853 -0.1157047 -0.0023986 -0.0455914 1.0365109 0.0929379 0.0047221 0.0865112 0.1953775 0.1938125 0.2538679 -0.0333143 0.0121268 0.1283677 0.0176989 0.0013374 0.1631942 -0.0124323 0.397297 -0.1660904 -0.0186451 -0.1495495 0.1827053 0.022134 -0.0106743 -0.0055149 0.0033733 -0.7325885 0.1976691 0.0127966 0.1086296 -0.3038143 -0.0308265 -0.0015684 -0.0122447 0.0414932 -0.6944429 -0.1067608 -0.0120389 0.0416791 -0.2514169 -0.0080128 -0.0265901 -0.0352776 0.0576442 1.2138881 0.0783447 0.0037222 -0.1123362 1.1955943 0.0888798 0.053848 0.0681177 0.1192332 -0.0675506 0.0261298 -0.0890928 -0.1519546 -0.4480965 0.0136519 -0.0226202 -0.0033075 -0.0907188 -0.4256442 0.3151982 0.0448875 0.2883692 -0.0221049 0.0098572 0.0274811 -0.0124761 -0.0858523 0.3419103 -0.0010661 0.0016993 -0.141616 0.0168642 0.0029972 -0.0186846 0.0059798 -0.0727975 0.1800249 0.0215817 0.0112002 -0.1391376 0.1753952 0.0180042 0.0023343 0.021135 -0.0910133 -0.8574823 0.0472822 0.0058935 0.025312 0.0010827 -0.0042547 -0.0064889 -0.0052067 0.0552583 0.2918012 -0.2012155 -0.0162744 0.1561663 -0.0406304 0.0114371 0.0238303 0.0048991 -0.0830659 -0.0239741 -0.1085955 0.0344171 0.2655721 0.005716 0.0340881 -0.0138786 -0.0879137 -0.0913272 -0.0203375 -0.0807726 0.014602 -0.2939369 -0.1138134 -0.0092908 -0.0050506 -0.0117217 -0.1348683 0.5989026 -0.0479389 0.8065177 0.5353787 1.5046121 -0.0995234 0.5391893 -0.3591054 1.3950411 0.0749401 -0.0551714 -0.0232319 -0.0450145 0.0241324 -0.0159871 -0.0352382 -0.0131284 0.1298084 0.1369407 -0.0159526 -0.0018718 -0.0120566 0.0998621 -0.0054291 -0.0008944 -0.0049973 0.1710444 0.1125141 -0.02574 -0.0031761 0.0285117 0.0005293 -0.0063967 -0.0003558 -0.0046928 0.157246 0.1118349 0.0444437 0.007664 0.0167857 0.0783834 -0.0095983 -0.0012085 -0.0070954 0.1638378 0.0164777 -0.042905 -0.0023252 -0.077435 0.0584586 -0.0152188 -0.0150801 0.0118306 0.1455041 -0.0478253 0.0633475 -0.0156151 0.0579168 0.0509338 0.0066852 -0.0066523 0.0049691 0.1643915 unknown
polarizability: 303.2990944|-11.1397018|215.8792374|11.4527368|0.7690125|83.5967718 unknown
InChI: InChI=1S/C14H6ClNO4/c15-14(18)10-3-1-2-9-12(10)8-5-4-7(16(19)20)6-11(8)13(9)17/h1-6H
charge 0 multiplicity 1
26 atoms
Cl 1.847345 2.910202 -1.458447
O  -0.210408 -3.361976 -0.249199
O  3.32999 2.824342 0.83404
O  -4.943124 1.476611 0.110032
O  -5.009788 -0.793356 -0.120688
N  -4.374711 0.3235 -0.003785
C  1.366263 -0.12372 -0.006758
C  -0.084596 0.238409 0.000433
C  -0.846756 -0.968904 -0.102619
C  1.465355 -1.548563 -0.057074
C  0.086972 -2.143175 -0.154186
C  2.562919 0.628533 0.084562
C  -0.755948 1.470834 0.130953
C  -2.244858 -0.977621 -0.111964
C  2.687619 -2.231786 -0.004121
C  -2.889339 0.276602 0.000765
C  -2.170599 1.485764 0.129684
C  3.809085 -0.065526 0.19265
C  3.875145 -1.472389 0.137042
C  2.68041 2.111322 0.07722
H  -0.214465 2.413645 0.226001
H  -2.820406 -1.903497 -0.194362
H  2.705577 -3.32495 -0.056809
H  -2.726543 2.42228 0.225182
H  4.727897 0.520637 0.2971
H  4.847667 -1.969318 0.202549
