program: Gaussian 09
title: 000272376
version: EM64L-G09RevD.01
frameworkgroup: C1[X(C15H10BrNO2)]
method: RPBEPBE
basis: SDD
operation: Freq
keyword: #p
keyword: freq=noraman
keyword: PBEPBE/SDD
title: #p freq=noraman PBEPBE/SDD
converged: YES YES NO YES
title: Mulliken charges:
elementType: Br O O N C C C C C C C C C C C C C C C H H H H H H H H H H
charge: 0.022303 -0.142891 -0.242722 -0.450398 0.281992 0.284492 0.235453 0.231820 -0.309606 -0.543629 -0.382482 0.530142 -0.334636 -0.409684 -0.478253 -0.208897 -0.196133 0.215621 -0.799190 0.353195 0.248065 0.264963 0.284606 0.224859 0.257401 0.313191 0.238439 0.273503 0.238477
chargesum: 0.00000
title: Mulliken charges with hydrogens summed into heavy atoms:
elementType: Br O O N C C C C C C C C C C C C C C C
charge: 0.022303 -0.142891 -0.242722 -0.137207 0.281992 0.284492 0.235453 0.231820 -0.309606 -0.190435 -0.134417 0.530142 -0.069673 -0.125079 -0.253394 -0.208897 0.061268 0.215621 -0.048770
polarizability: 3.84674877e+02 2.00055495e+00 2.02005612e+02 5.00888994e-03 -2.31744868e-04 7.38963481e+01
1716.lowfreq: -72.8354 -5.5325 -0.0003 0.0005 0.0010 2.6715 3.1139 30.3846 56.4848
frequency: -72.8282 30.3739 56.4848 76.7731 80.6030 108.2666 127.5166 147.1818 191.1914 219.5342 236.6637 252.2115 267.1431 335.3661 347.1793 352.3857 417.6595 439.9870 444.4846 511.2476 540.6947 549.2327 576.3958 576.9955 603.7128 643.2999 644.9546 663.2677 683.6921 724.0004 762.9109 773.1736 807.5535 838.3550 838.5347 860.3724 896.1665 927.3975 951.1309 952.9194 967.9969 980.4079 988.6901 1019.8028 1031.7290 1048.6088 1080.2504 1111.9321 1146.5057 1183.2480 1211.5746 1221.8219 1260.8614 1272.9206 1277.6010 1355.2031 1376.4671 1377.4948 1398.2144 1434.9004 1448.7228 1463.2995 1467.9304 1483.0835 1509.7599 1582.3977 1594.1150 1603.1532 1620.1270 1635.6979 1643.0277 2987.7069 3072.7784 3114.3965 3138.6370 3149.0280 3153.1782 3162.2955 3178.2093 3189.5107 3520.4199
redmass: 1.0575 7.5765 4.9323 7.5061 7.3215 4.3045 9.1058 4.8896 5.5080 15.2755 6.7913 5.9502 5.5575 5.5021 4.4641 6.4387 3.2184 4.9552 3.1264 5.4312 5.0304 5.6611 3.2445 8.3473 3.1888 6.6325 1.2060 6.8846 3.6420 6.5134 6.1567 3.6358 2.0328 6.5903 1.5348 2.2098 1.5603 6.4697 2.9581 1.4305 1.3937 1.4953 2.1345 3.5949 1.6647 2.1679 3.0131 1.8727 1.6142 2.2337 1.8148 3.1394 1.4294 2.0907 1.8167 6.4986 1.2428 3.7801 3.8703 2.1724 1.2106 5.5498 1.0467 3.8608 1.9510 8.0704 8.0841 7.0918 7.8495 7.0028 6.8551 1.0385 1.0984 1.0889 1.0978 1.0955 1.0902 1.0929 1.0962 1.0938 1.0764
irintensity: 0.0058 0.7958 9.6891 2.0406 1.5713 1.1244 0.9287 0.2381 0.6707 1.1524 8.4566 0.1439 1.1987 14.2138 0.1114 0.7588 7.1726 0.1958 1.6033 7.6575 9.9446 4.1586 4.0908 4.4405 28.4879 6.3077 56.9965 8.5488 2.3145 7.8816 10.3936 0.3418 45.6125 72.4649 54.6283 11.1106 9.7080 1.9907 70.8919 1.7561 12.8098 13.2335 6.0549 32.0747 7.9258 37.5448 0.8777 41.7741 21.0997 22.4684 9.0174 114.6140 10.2384 60.7506 34.6326 99.7087 48.8723 216.4844 27.8642 10.0267 74.2248 93.4595 20.7198 436.9909 185.2377 155.5419 109.8274 132.8767 36.4390 11.1598 204.1267 8.0467 14.2197 22.6068 6.3208 10.4452 1.7735 2.4527 2.6212 12.4038 14.4815
temp: 298.150 k
press: 1.00000 atm
elementType: 35 8 8 7 6 6 6 6 6 6 6 6 6 6 6 6 6 6 6 1 1 1 1 1 1 1 1 1 1
symmnumber: 1
zpe: 549808.0 jmol-1
zpe.correction: 0.209411 hartree
zpe.thermalcorrener: 0.224872 hartree
zpe.thermalcorrenthalpy: 0.225816 hartree
zpe.thermalcorrgfe: 0.164830 hartree
zpe.sumelectzpe: -794.987635 hartree
zpe.sumelectthermal: -794.972174 hartree
zpe.sumelectthermalent: -794.971230 hartree
zpe.sumelectthermalfe: -795.032216 hartree
dipole: -1.7734 -6.5130 0.0004
dipole: 6.7501
quadrupole: -101.5909 -116.6974 -122.1869
quadrupole: 31.4410 -0.0030 -0.0003
quadrupole: 11.9008 -3.2057 -8.6952 31.4410 -0.0030 -0.0003
hfenergy: -795.1970462 hartree
pointgroup: C01 [X(C15H10Br1N1O2)]
dipole: 0.9558215 2.4777324 -0.0028932 debye
polarizability: 383.1753664|-16.6032115|203.5049129|0.0428929|-0.1644278|73.8965582 unknown
InChI: InChI=1S/C15H10BrNO2/c1-8(18)17-10-3-5-11-13-6-9(16)2-4-12(13)15(19)14(11)7-10/h2-7,17H,1H3
charge 0 multiplicity 1
29 atoms
Br -5.893607 1.635814 -0.002253
O  -0.316105 -2.883417 0.003951
O  4.513059 -1.366835 0.002297
N  3.827381 0.879923 -0.000473
C  -0.422913 0.723283 -0.000817
C  -1.865608 0.37305 -0.000484
C  0.338542 -0.48269 0.000822
C  -1.986563 -1.049736 0.001357
C  -0.610214 -1.657736 0.002193
C  1.738269 -0.498353 0.00103
C  0.243928 1.960277 -0.002335
C  2.412281 0.760611 -0.000513
C  -3.014053 1.184247 -0.001587
C  -3.239584 -1.678707 0.002122
C  1.657554 1.96908 -0.002173
C  -4.272193 0.531291 -0.000795
C  -4.408939 -0.874944 0.001026
C  4.796147 -0.136542 0.000796
C  6.231654 0.38895 0.000557
H  2.302307 -1.433046 0.002305
H  -0.303819 2.908498 -0.003622
H  -2.954883 2.276225 -0.002973
H  -3.312803 -2.770916 0.003532
H  2.186537 2.931035 -0.003369
H  -5.40219 -1.33131 0.001575
H  4.187028 1.837809 -0.001528
H  6.434299 1.00443 -0.895618
H  6.917763 -0.469545 0.001357
H  6.434029 1.005854 0.895817
