program: Gaussian 09
title: 000272375
version: EM64L-G09RevD.01
frameworkgroup: C1[X(C13H5Br2NO3)]
method: RPBEPBE
basis: SDD
operation: Freq
keyword: #p
keyword: freq=noraman
keyword: PBEPBE/SDD
title: #p freq=noraman PBEPBE/SDD
converged: NO YES NO NO
title: Mulliken charges:
elementType: Br Br O O O N C C C C C C C C C C C C C H H H H H
charge: 0.094667 0.095279 -0.129177 -0.202357 -0.193532 0.021601 0.290545 0.312120 0.242822 0.213615 -0.290042 -0.363504 -0.550941 -0.326557 -0.356106 0.411284 -0.372542 -0.172028 -0.191097 0.259893 0.331803 0.274983 0.304728 0.294541
chargesum: 0.00000
title: Mulliken charges with hydrogens summed into heavy atoms:
elementType: Br Br O O O N C C C C C C C C C C C C C
charge: 0.094667 0.095279 -0.129177 -0.202357 -0.193532 0.021601 0.290545 0.312120 0.242822 0.213615 -0.290042 -0.103611 -0.219138 -0.051574 -0.051378 0.411284 -0.078001 -0.172028 -0.191097
polarizability: 4.05560121e+02 2.65116720e+00 2.10662688e+02 5.01550143e-03 -4.88712225e-03 6.55077153e+01
1716.lowfreq: -8.7363 -7.1186 -5.0403 -0.0005 -0.0001 0.0008 33.4174 41.3898 59.5618
frequency: 33.4173 41.3386 59.5617 82.9271 111.7630 121.7517 153.5000 174.1263 183.7206 191.5141 228.0417 240.9212 282.2328 355.7326 359.6904 398.8426 421.4297 443.6938 480.3026 498.0764 521.8234 577.8070 591.0629 594.7579 643.6793 670.1862 672.1850 705.1474 730.5099 758.0180 772.0301 820.4858 843.5339 864.4287 900.1218 928.0584 946.5908 969.1518 996.7020 1012.7252 1054.4825 1082.9751 1108.6956 1134.6955 1172.1505 1207.6448 1222.6981 1233.1213 1269.4489 1347.6171 1350.8374 1369.1710 1403.8016 1433.8978 1439.7220 1477.4757 1577.4584 1588.4481 1600.7595 1614.4192 1643.1078 3154.0867 3164.5048 3167.3313 3179.6591 3184.5498
redmass: 15.7699 12.9781 10.8056 14.2284 9.2221 54.5886 5.8135 15.1814 5.0517 19.5664 18.6382 8.2128 9.2386 6.7378 10.5492 8.2954 3.3226 3.2561 5.5244 9.3973 6.6692 5.8229 8.4594 6.3473 7.3996 6.5331 9.8717 4.9264 6.3493 11.0978 3.6136 4.0120 9.4750 1.4412 1.6158 1.5062 6.0466 1.5923 1.3855 5.6685 1.9560 2.0623 3.7585 2.0007 3.8731 5.5119 3.2068 1.3162 1.6906 4.4032 9.9209 7.4116 4.6510 3.3833 3.5506 5.8929 10.0942 8.2518 8.3182 8.2445 11.5615 1.0910 1.0929 1.0936 1.0934 1.0951
irintensity: 0.3276 0.8365 2.1641 1.1203 0.3408 0.1639 1.7280 1.9279 2.2373 1.1764 0.8535 0.2628 2.1502 1.9608 5.9388 11.2574 12.4785 1.3556 5.4845 1.3569 8.9979 2.6258 5.0323 0.1672 3.6085 10.4061 26.6904 11.7271 1.3004 19.5567 0.0635 11.8230 30.7004 41.6560 5.3185 7.3070 36.7501 25.5970 0.5855 11.2303 45.7838 64.6272 12.7201 135.6808 67.5924 306.2142 258.0193 11.1237 23.7175 20.6512 46.9481 134.4847 45.4675 21.6909 7.6861 10.1654 12.0844 148.4237 16.1410 160.9447 155.3380 4.0051 0.6168 1.5004 7.3914 2.8520
temp: 298.150 k
press: 1.00000 atm
elementType: 35 35 8 8 8 7 6 6 6 6 6 6 6 6 6 6 6 6 6 1 1 1 1 1
symmnumber: 1
zpe: 386180.6 jmol-1
zpe.correction: 0.147088 hartree
zpe.thermalcorrener: 0.162730 hartree
zpe.thermalcorrenthalpy: 0.163674 hartree
zpe.thermalcorrgfe: 0.101126 hartree
zpe.sumelectzpe: -804.361242 hartree
zpe.sumelectthermal: -804.345600 hartree
zpe.sumelectthermalent: -804.344656 hartree
zpe.sumelectthermalfe: -804.407204 hartree
dipole: 4.1722 -3.4099 0.0007
dipole: 5.3884
quadrupole: -168.0235 -126.3505 -126.8771
quadrupole: 7.4648 -0.0034 0.0001
quadrupole: -27.6065 14.0666 13.5399 7.4648 -0.0034 0.0001
hfenergy: -804.5083299 hartree
pointgroup: C01 [X(C13H5Br2N1O3)]
dipole: -1.5741307 1.4199961 0.0002828 debye
dipolederiv: -0.3909148 0.3384953 0.0000082 0.4753845 -0.3456975 -0.0000073 -0.0000003 -0.0000023 0.0302969 -0.761442 -0.2288595 -0.000024 -0.3155205 -0.0513758 -0.0000101 -0.0000444 -0.0000164 0.0318417 -0.536736 0.0644703 -0.0000056 0.1436874 -1.0230815 0.0000624 0.0000292 -0.0001352 -0.2816441 -0.991571 -0.2085366 0.0000346 -0.3428121 -0.6114595 0.0000145 0.0000921 0.0000549 -0.2246581 -0.8378748 0.1699668 0.0000198 0.3559817 -0.6540076 0.0000272 0.000073 -0.0000265 -0.219686 2.3926853 0.0017396 -0.0001085 -0.1324045 1.0444652 -0.0000442 -0.0001766 -0.0000381 0.1871958 0.8431029 0.1691456 0.0000039 0.1284308 0.1416822 -0.000001 0.0000744 0.0000227 0.0170199 -0.1776643 -0.1372368 -0.0000105 -0.1803662 0.1158003 -0.000001 -0.0000807 0.0000158 0.004864 -0.9000471 -0.1489964 0.0000114 0.1108023 -0.2543177 -0.0000255 0.0000431 0.0000064 0.0274564 -0.769095 0.3197512 0.0000134 0.3808109 -0.2258751 -0.0000179 -0.0000232 0. 0.035086 1.4254341 -0.1252856 -0.000001 -0.1309515 1.2430145 -0.0000402 -0.0000274 0.0000784 0.120082 -0.6577833 -0.2524861 0.0000072 -0.3046144 0.0591679 0.0000288 -0.0000114 0.0000101 -0.1288879 0.4696239 -0.0287262 -0.0000186 0.1207419 0.0073629 -0.0000104 -0.0000616 0.0000088 -0.0666239 -0.2893244 0.3270089 -0.0000009 0.0800057 -0.0846708 0.0000056 0.0000015 0.0000067 -0.0676784 -0.1656606 -0.2265336 -0.0000144 0.099514 0.0919001 -0.0000005 -0.0000048 -0.0000033 -0.0337763 -1.0451442 0.0342342 0.0000574 0.1058817 -0.0195987 0.0000016 0.0000884 0.0000065 0.0479479 0.3901282 0.1339671 -0.0000244 -0.277002 -0.0295537 0.0000133 -0.0000614 -0.0000194 -0.0822417 0.4420588 -0.8710751 -0.0000189 -0.9763927 0.5677868 0.0000203 -0.000023 -0.000005 -0.0863944 1.1016892 0.6717257 0.0000627 0.684768 -0.1533462 0.0000096 0.0000817 0.0000327 -0.113814 0.0567334 0.0794476 0.0000078 0.0543563 -0.0227176 -0.0000094 -0.0000062 -0.0000049 0.1509677 0.1428795 0.0117086 0.0000025 0.0021656 0.0962804 -0.0000033 0.0000122 0.0000006 0.1717324 0.0746651 -0.05432 -0.000004 -0.027354 -0.0095236 -0.0000058 0.0000123 -0.0000047 0.1537605 0.087301 0.016483 -0.0000013 -0.0372864 0.032324 -0.0000049 -0.0000045 -0.0000006 0.1584161 0.0969561 -0.0560882 0.0000033 -0.0178264 0.0854409 -0.000002 0.0000177 0.000013 0.1687375 unknown
polarizability: 405.3550805|-6.8519031|210.8677293|-0.0047713|0.0051258|65.5077153 unknown
InChI: InChI=1S/C13H5Br2NO3/c14-11-4-8-7-2-1-6(16(18)19)3-9(7)13(17)10(8)5-12(11)15/h1-5H
charge 0 multiplicity 1
24 atoms
Br -4.873003 2.375413 0.000019
Br -5.645414 -1.018037 -0.000161
O  -0.05937 -2.959676 -0.000212
O  5.319398 1.197699 -0.000357
O  5.076327 -1.071201 -0.000271
N  4.598388 0.126727 -0.000201
C  0.352788 0.626912 0.000063
C  -1.123742 0.485688 0.000068
C  0.92928 -0.681661 -0.000011
C  -1.447925 -0.902887 0.000007
C  -0.176256 -1.707469 0.000089
C  1.177767 1.766403 0.000071
C  2.313373 -0.880577 -0.000105
C  -2.143684 1.447743 0.000075
C  -2.774436 -1.34704 -0.000068
C  3.122155 0.282193 -0.000154
C  2.580629 1.588481 -0.000023
C  -3.493676 1.006734 0.000011
C  -3.810848 -0.378534 -0.000066
H  0.757359 2.776535 0.00012
H  2.761177 -1.877889 -0.000146
H  -1.928194 2.519535 0.000112
H  -3.005088 -2.416231 -0.000107
H  3.265995 2.440342 -0.000054
