program: Gaussian 09
title: 000272365
version: EM64L-G09RevD.01
frameworkgroup: C1[X(C20H19OP)]
method: RPBEPBE
basis: SDD
operation: Freq
keyword: #p
keyword: freq=noraman
keyword: PBEPBE/SDD
title: #p freq=noraman PBEPBE/SDD
converged: YES YES NO NO
title: Mulliken charges:
elementType: P O C C C C C C C C C C C C C C C C C C C C H H H H H H H H H H H H H H H H H H H
charge: 1.011773 -0.659673 -0.852895 -0.852599 -0.095600 0.516586 0.516391 -0.276615 -0.297928 -0.347731 -0.414287 -0.413987 -0.347828 -0.232458 -0.205003 -0.225115 -0.231090 -0.222790 -0.222843 -0.231163 -0.241344 -0.241363 0.237359 0.272138 0.272232 0.237269 0.223397 0.291497 0.270774 0.220693 0.220697 0.271164 0.230670 0.233928 0.231617 0.226543 0.223480 0.223481 0.226547 0.227041 0.227034
chargesum: 0.00000
title: Mulliken charges with hydrogens summed into heavy atoms:
elementType: P O C C C C C C C C C C C C C C C C C C C C
charge: 1.011773 -0.659673 -0.343398 -0.343098 -0.095600 0.516586 0.516391 -0.053219 -0.006431 -0.076957 -0.193594 -0.193290 -0.076663 -0.001788 0.028925 0.006503 -0.004547 0.000691 0.000638 -0.004616 -0.014303 -0.014329
polarizability: 2.78913203e+02 -8.86510011e-02 2.19079707e+02 3.41958013e-02 -2.35573404e+01 1.98926676e+02
1716.lowfreq: -11.0254 -0.0006 0.0003 0.0015 3.8505 9.5706 23.7456 26.2319 30.2183
frequency: 23.4099 25.8932 29.6936 31.0039 45.2283 46.0466 92.5092 105.0847 114.4377 142.7072 196.0881 199.7331 215.5623 221.5629 310.7829 316.6852 329.8534 375.8055 386.7086 399.4851 403.5443 403.7816 467.2742 474.9680 497.1925 562.8503 571.3929 611.1298 614.4718 616.6276 646.6883 649.8465 695.3125 700.1519 701.1322 706.7858 761.0294 763.5549 769.3232 802.4713 812.4134 839.5202 848.5657 849.4298 864.0631 865.1361 919.2591 924.7975 937.3889 966.2648 972.8306 973.7762 988.0597 988.1539 989.0963 989.1405 995.0273 995.3148 1010.0765 1020.8812 1027.7975 1028.2555 1069.7569 1073.1827 1082.0287 1091.0754 1126.4214 1156.9103 1172.7195 1173.1109 1174.2454 1188.9102 1191.4299 1192.2717 1201.4949 1213.2216 1220.0501 1238.0549 1310.6878 1329.0533 1330.0199 1380.3501 1383.0728 1383.9302 1422.2874 1425.6910 1432.0863 1442.3790 1444.0838 1467.1001 1483.6516 1484.1480 1589.2224 1592.0236 1592.7013 1597.3871 1613.7493 1613.8948 3001.3333 3003.9691 3069.7444 3074.6230 3108.3654 3114.6556 3114.8071 3126.8654 3126.9180 3128.7452 3137.9117 3139.3857 3139.4729 3149.5220 3151.1960 3151.3244 3164.6261 3164.6960 3165.0800
redmass: 5.3536 5.2289 3.8074 4.4331 4.7753 3.7239 3.7612 5.6039 5.3996 5.1121 4.6684 5.3429 6.9797 6.1670 2.3032 2.2625 6.4093 4.0413 4.4018 2.8196 2.8054 2.8160 3.7598 3.6888 4.2555 5.5652 3.9908 6.4081 6.2521 6.2761 5.2352 4.7950 5.6689 1.8199 1.7112 1.8838 1.7514 1.6890 1.9936 4.3999 4.1470 1.6063 1.2604 1.2712 1.2496 1.8487 1.4294 1.5199 1.3820 4.8571 1.4205 1.5884 1.4807 5.7534 3.2243 4.1058 1.4678 1.4660 1.3249 2.8918 2.2239 2.2094 1.5114 1.6071 1.6206 2.6368 1.1119 1.1480 1.0518 1.0515 1.0555 1.1280 1.1342 1.1320 1.2497 1.6471 2.9786 1.8563 1.3219 1.2726 1.2686 8.6227 8.5254 8.3237 1.1280 2.0716 1.2046 2.1290 1.9501 2.0508 2.3131 2.3219 6.0996 6.0933 6.0605 5.8290 6.0802 6.0588 1.0584 1.0587 1.1034 1.1028 1.0880 1.0872 1.0871 1.0867 1.0867 1.0865 1.0912 1.0920 1.0921 1.0960 1.0960 1.0960 1.1015 1.1015 1.1014
irintensity: 0.0460 0.4513 0.0035 0.0136 0.1488 0.0356 1.7333 5.6216 0.5050 3.7418 0.0605 7.6572 12.1362 4.1520 1.4928 1.4739 0.3124 21.0735 17.9717 0.1465 0.1941 0.1156 8.4662 46.3086 49.0876 2.2289 48.4550 0.0132 7.4291 0.0758 27.2100 1.6847 2.5712 47.8750 79.8863 46.7608 42.7622 3.9605 67.2988 16.4494 8.6917 0.6799 5.4194 0.5232 0.0158 26.1526 0.0697 22.3780 0.2780 40.1427 0.0196 1.8604 0.0334 1.2327 0.1063 0.8528 0.0186 1.0411 0.1325 1.2334 16.9787 1.1696 0.6126 20.9081 6.7703 43.3626 0.0578 4.5068 0.1402 0.2052 0.2793 0.8243 0.6367 0.7128 6.8423 0.5870 20.7098 1.6710 4.9900 0.2050 1.0955 0.8439 0.0156 0.2264 1.2800 13.6058 19.1076 1.6666 23.2076 5.2265 50.9819 4.4604 0.4706 1.0218 2.6300 0.1467 20.7281 0.6716 9.3506 22.6651 0.0067 10.5493 7.5490 9.8384 9.0113 1.2035 0.6252 2.0136 5.9322 5.0509 48.7737 18.2895 21.6232 25.5526 38.6112 9.7574 28.1524
temp: 298.150 k
press: 1.00000 atm
elementType: 15 8 6 6 6 6 6 6 6 6 6 6 6 6 6 6 6 6 6 6 6 6 1 1 1 1 1 1 1 1 1 1 1 1 1 1 1 1 1 1 1
symmnumber: 1
zpe: 861004.5 jmol-1
zpe.correction: 0.327939 hartree
zpe.thermalcorrener: 0.347864 hartree
zpe.thermalcorrenthalpy: 0.348808 hartree
zpe.thermalcorrgfe: 0.276149 hartree
zpe.sumelectzpe: -1188.426791 hartree
zpe.sumelectthermal: -1188.406866 hartree
zpe.sumelectthermalent: -1188.405922 hartree
zpe.sumelectthermalfe: -1188.478582 hartree
dipole: -0.0034 2.7142 -3.0028
dipole: 4.0476
quadrupole: -132.1713 -128.6639 -128.5191
quadrupole: -0.0224 -0.0037 0.0910
quadrupole: -2.3865 1.1209 1.2656 -0.0224 -0.0037 0.0910
hfenergy: -1188.7547305 hartree
pointgroup: C01 [X(C20H19O1P1)]
dipole: -0.0093251 1.0495732 -1.1975986 debye
polarizability: 278.9100186|-0.255028|218.3516411|-0.5020862|-23.8544587|199.6579266 unknown
InChI: InChI=1S/C20H19OP/c21-22(20-14-8-3-9-15-20,16-18-10-4-1-5-11-18)17-19-12-6-2-7-13-19/h1-15H,16-17H2
charge 0 multiplicity 1
41 atoms
P  0.000137 -0.872482 -0.224547
O  0.010575 -1.670989 1.18555
C  1.497738 -1.291819 -1.339549
C  -1.511945 -1.295308 -1.318535
C  -0.000545 0.979575 0.006457
C  2.82163 -1.016635 -0.659791
C  -2.826702 -1.019808 -0.621264
C  -0.007757 1.881245 -1.083068
C  0.006278 1.459866 1.335549
C  3.211174 -1.768452 0.481236
C  -3.701128 -0.009972 -1.097064
C  3.687253 -0.002812 -1.143212
C  -3.198579 -1.76713 0.528614
C  -0.008051 3.273384 -0.839947
C  0.005945 2.852548 1.574677
C  -0.001164 3.758873 0.489168
C  4.44861 -1.516061 1.111845
C  -4.931799 0.241565 -0.449204
C  4.926523 0.248071 -0.511669
C  -4.427442 -1.514048 1.175526
C  5.312518 -0.510852 0.616841
C  -5.300247 -0.512765 0.688195
H  1.389938 -0.721073 -2.27893
H  1.372191 -2.366656 -1.569661
H  -1.388576 -2.370527 -1.548097
H  -1.417523 -0.726463 -2.260557
H  -0.013266 1.51494 -2.117945
H  0.011664 0.735635 2.158624
H  2.530042 -2.526396 0.883206
H  -3.419653 0.579655 -1.97864
H  3.392158 0.590284 -2.017993
H  -2.510177 -2.52179 0.924366
H  -0.013627 3.975822 -1.680831
H  0.011211 3.228909 2.603404
H  -0.001389 4.838664 0.676259
H  4.737065 -2.100075 1.993119
H  -5.599668 1.021989 -0.83122
H  5.587443 1.031545 -0.899483
H  -4.702244 -2.09451 2.063493
H  6.273758 -0.31921 1.106928
H  -6.254772 -0.320636 1.191049
