program: Gaussian 09
title: 000272335
version: EM64L-G09RevD.01
frameworkgroup: C1[X(C16H12N2O)]
method: RPBEPBE
basis: SDD
operation: Freq
keyword: #p
keyword: freq=noraman
keyword: PBEPBE/SDD
title: #p freq=noraman PBEPBE/SDD
converged: NO YES NO NO
title: Mulliken charges:
elementType: O N N C C C C C C C C C C C C C C C C H H H H H H H H H H H H
charge: -0.286347 -0.445835 -0.106032 0.209086 0.421866 -0.098302 -0.346042 -0.408391 -0.315860 0.145416 -0.245790 0.468771 -0.225877 -0.386148 -0.346163 -0.444381 -0.214675 -0.196155 -0.255396 0.315496 0.237744 0.237771 0.235363 0.356630 0.234041 0.248053 0.306275 0.227814 0.225112 0.224607 0.227351
chargesum: 0.00000
title: Mulliken charges with hydrogens summed into heavy atoms:
elementType: O N N C C C C C C C C C C C C C C C C
charge: -0.286347 -0.089206 -0.106032 0.209086 0.421866 -0.098302 -0.030547 -0.170647 -0.078089 0.145416 -0.010427 0.468771 0.008164 -0.138095 -0.039889 -0.216568 0.010437 0.028452 -0.028045
polarizability: 3.48590443e+02 -1.16133138e+01 2.12431282e+02 -3.06155571e-02 7.92752539e-02 7.13705176e+01
1716.lowfreq: -4.3279 -0.0003 0.0007 0.0009 3.5499 8.8497 32.6055 46.4454 75.9966
frequency: 32.3971 46.4189 75.9894 93.4258 105.3108 183.5653 204.3757 215.8075 221.1042 274.6222 350.6358 368.1851 401.0048 409.9224 461.3168 474.5587 501.7237 504.8641 530.0561 542.7743 586.2840 614.3209 641.5144 662.1427 696.9478 731.3939 765.1707 767.7672 769.1758 791.3306 813.8360 840.3891 846.3708 853.6801 878.9500 890.0048 900.3320 923.5439 968.3435 975.2811 983.7319 988.2790 998.2262 1000.8702 1020.8800 1023.9575 1026.9596 1076.8238 1087.6720 1130.5855 1157.9127 1171.7513 1178.7702 1186.9599 1230.0999 1238.5474 1258.8733 1279.7465 1323.1514 1342.0505 1360.7848 1385.0484 1404.7397 1419.3968 1434.2306 1436.0065 1484.3056 1496.5659 1515.3452 1545.9428 1573.7578 1592.2572 1599.3885 1614.0597 1625.2856 3118.5126 3127.4297 3131.0257 3138.0292 3141.9029 3143.7503 3160.2032 3163.1841 3163.8080 3183.0229 3191.8417 3323.9164
redmass: 5.9527 4.1695 5.3790 6.7657 4.7969 5.0256 6.5829 4.3643 5.3799 4.7305 9.9198 5.3921 3.3515 2.9592 5.9853 3.7594 7.9113 3.2937 3.1880 7.5113 7.3362 6.5095 4.2068 6.6006 1.8920 3.5756 6.4601 1.4419 1.7277 6.0833 3.8280 1.2604 5.4456 1.3060 6.4401 1.1658 1.5515 1.4385 1.3966 1.3478 6.2093 1.3845 7.0531 1.3062 1.3206 2.3675 2.1317 2.2984 1.5742 2.1657 1.6127 1.0516 1.1481 1.1171 1.9050 2.0820 2.0913 1.8331 1.4137 2.8895 5.4755 7.4289 2.8180 3.3962 2.3342 2.1679 2.2758 3.2507 2.2579 6.9464 5.9748 5.1860 7.3674 6.1008 6.5175 1.0870 1.0864 1.0875 1.0874 1.0914 1.0939 1.0980 1.0988 1.0998 1.0965 1.0952 1.0763
irintensity: 2.4089 0.2811 1.2528 3.4101 0.1785 0.0470 0.1407 0.4236 13.0726 2.2062 5.8326 0.1268 1.0123 0.0726 1.9327 1.1827 3.9842 33.2814 0.0159 5.4123 28.4289 1.5414 0.5129 5.7885 41.1855 14.4351 7.1301 13.8173 69.9344 2.8168 3.1439 18.4549 0.4758 82.0222 10.4141 53.1157 0.0019 33.3468 0.0367 0.0841 0.0502 4.1083 2.4048 3.4905 2.1518 24.6326 2.3182 4.0425 15.9061 15.3291 8.8702 0.4017 13.4675 0.0114 6.5082 10.1860 5.5827 16.6705 29.2895 37.1115 17.0686 22.3353 2.1808 30.5448 87.4713 3.8842 13.8130 12.8279 554.2432 30.6225 27.7453 30.3696 123.0193 20.7751 3.3666 8.9784 0.7586 0.7599 1.4144 20.6760 32.4872 25.3224 42.6548 28.6384 37.3448 8.0831 125.4599
temp: 298.150 k
press: 1.00000 atm
elementType: 8 7 7 6 6 6 6 6 6 6 6 6 6 6 6 6 6 6 6 1 1 1 1 1 1 1 1 1 1 1 1
symmnumber: 1
zpe: 628604.3 jmol-1
zpe.correction: 0.239423 hartree
zpe.thermalcorrener: 0.253806 hartree
zpe.thermalcorrenthalpy: 0.254750 hartree
zpe.thermalcorrgfe: 0.196960 hartree
zpe.sumelectzpe: -800.369262 hartree
zpe.sumelectthermal: -800.354878 hartree
zpe.sumelectthermalent: -800.353934 hartree
zpe.sumelectthermalfe: -800.411724 hartree
dipole: 3.0443 2.2903 0.0077
dipole: 3.8096
quadrupole: -82.9719 -98.1497 -117.0645
quadrupole: -0.7767 -0.0061 0.0363
quadrupole: 16.4235 1.2456 -17.6691 -0.7767 -0.0061 0.0363
hfenergy: -800.6086843 hartree
pointgroup: C01 [X(C16H12N2O1)]
dipole: -1.2758254 0.6228594 0.4803816 debye
polarizability: 345.1800722|22.4775666|166.2278622|9.8382132|68.4967139|120.9843081 unknown
InChI: InChI=1S/C16H12N2O/c19-16(18-13-7-2-1-3-8-13)15-14-9-5-4-6-12(14)10-11-17-15/h1-11,18H
charge 0 multiplicity 1
31 atoms
O  0.625103 -1.473571 -0.852658
N  1.462908 0.319481 0.427304
N  -0.885793 1.162736 1.10478
C  -2.167618 -0.543775 -0.114536
C  -3.397877 0.070121 0.361665
C  -0.925229 0.067475 0.3037
C  -2.25872 -1.702631 -0.959268
C  -4.661517 -0.488616 -0.019159
C  -3.310042 1.223384 1.203947
C  0.449737 -0.453954 -0.108955
C  -3.507815 -2.221138 -1.310364
C  2.863469 0.177323 0.292892
C  -4.716162 -1.614957 -0.840675
C  -2.05604 1.729737 1.547116
C  3.469533 -0.860168 -0.469003
C  3.683632 1.131643 0.958651
C  4.876809 -0.924683 -0.552649
C  5.086841 1.052163 0.864118
C  5.694416 0.022202 0.106771
H  -1.330489 -2.157337 -1.31136
H  -5.581203 -0.016495 0.34536
H  -4.221669 1.703381 1.57528
H  -3.564291 -3.105523 -1.954286
H  1.084755 1.095764 0.999979
H  -5.683974 -2.03966 -1.129294
H  -1.947818 2.60885 2.189597
H  2.834785 -1.590025 -0.974828
H  3.216591 1.931686 1.546725
H  5.33712 -1.726648 -1.140938
H  5.705977 1.7939 1.380957
H  6.78548 -0.039965 0.033629
