program: Gaussian 09
title: 000272455
version: EM64L-G09RevD.01
frameworkgroup: C1[X(C19H22N4O8S)]
method: RPBEPBE
basis: SDD
operation: Freq
keyword: #p
keyword: freq=noraman
keyword: PBEPBE/SDD
title: #p freq=noraman PBEPBE/SDD
converged: YES YES NO NO
title: Mulliken charges:
elementType: S O O O O O O O O N N N N C C C C C C C C C C C C C C C C C C C H H H H H H H H H H H H H H H H H H H H H H
charge: 0.987537 -0.477644 -0.276429 -0.492036 -0.487061 -0.195618 -0.289966 -0.210663 -0.209451 -0.379380 -0.351484 0.027243 0.015322 -0.226949 -0.344346 0.228246 0.318656 -0.364617 0.245266 -0.347430 -0.044728 -0.280578 -0.506425 -0.419970 0.449820 -0.253299 -0.205119 -0.687808 0.449854 -0.390750 -0.340516 -0.793706 0.272979 0.270817 0.243661 0.376670 0.367192 0.257015 0.213466 0.219045 0.205792 0.313628 0.334536 0.294713 0.290732 0.306511 0.219313 0.229238 0.206931 0.251381 0.262592 0.229898 0.242472 0.245449
chargesum: 0.00000
title: Mulliken charges with hydrogens summed into heavy atoms:
elementType: S O O O O O O O O N N N N C C C C C C C C C C C C C C C C C C C
charge: 0.987537 -0.477644 -0.276429 -0.492036 -0.487061 -0.195618 -0.289966 -0.210663 -0.209451 -0.002711 0.015708 0.027243 0.015322 0.046030 0.170131 0.228246 0.318656 0.105864 0.245266 0.077407 -0.044728 0.033050 -0.171889 -0.125256 0.449820 0.037433 0.101393 -0.032327 0.449854 -0.139369 -0.077924 -0.075887
polarizability: 4.42828988e+02 7.97389774e+00 3.37046997e+02 -8.78950975e+00 3.52764220e+01 2.14688974e+02
1716.lowfreq: -17.4752 -10.3518 -6.5509 -0.0014 -0.0012 -0.0005 1.0949 5.0425 13.3907
frequency: -15.3791 -8.6288 13.2933 20.8218 25.3159 31.4322 36.0959 47.3723 55.6264 58.4930 65.4365 77.4230 78.8150 92.4585 102.6740 113.1420 120.7557 127.9931 145.5036 166.3006 167.1252 190.9102 201.8084 213.3675 230.0182 238.3462 249.0539 268.9235 287.2725 296.1960 309.4928 317.0369 333.4340 346.3913 365.6451 374.5829 383.6002 393.9838 407.2941 409.6079 441.3537 451.8755 470.3238 483.6828 504.3332 512.3749 516.7897 572.6339 589.6635 605.9329 617.8256 633.8518 653.5091 662.9358 698.3425 705.5110 710.5812 729.0246 736.0747 740.4514 753.5262 762.3150 777.0240 811.6017 819.1632 824.2002 830.5760 836.8596 841.4589 854.2425 871.8912 881.2697 896.3991 929.5682 960.9551 962.0147 963.4628 969.1856 980.5248 985.3325 994.0711 999.0193 1005.2575 1043.7252 1049.7906 1050.8310 1052.0936 1093.2989 1101.0228 1109.1092 1120.7840 1125.8896 1139.1427 1154.5489 1171.2561 1191.3628 1207.9996 1220.6539 1221.6351 1247.4131 1252.8824 1268.8505 1278.4484 1283.0341 1299.0859 1301.2854 1322.8458 1340.4201 1343.9741 1352.8030 1359.6892 1365.5584 1381.1080 1385.4607 1392.0539 1395.3677 1400.1762 1455.9799 1461.6915 1465.5201 1467.4721 1467.9419 1470.7754 1473.6916 1476.1256 1480.6510 1488.5991 1522.0014 1532.4841 1574.5964 1588.0323 1589.7668 1618.8880 1628.0496 2973.1285 2982.8802 2985.6150 2986.3621 2989.0875 3023.0974 3040.2611 3062.2562 3065.5143 3069.7565 3075.9324 3078.8446 3096.6770 3144.5165 3147.7076 3149.4003 3167.6355 3179.0987 3185.3011 3189.4561 3319.1663 3406.3529
redmass: 1.7440 1.7996 4.8333 5.8143 5.8938 7.2799 4.4723 4.0681 11.9606 5.0746 9.5607 7.0572 8.0874 3.3332 3.3860 7.7899 4.3975 7.4617 5.8106 6.4640 7.1257 5.9884 4.7939 2.8032 7.1852 1.8017 4.2452 4.4268 5.0992 4.5595 7.0424 4.5495 5.8496 3.4021 3.9969 4.8192 5.2250 7.3633 3.2562 6.2184 4.0000 8.5646 4.8188 2.7872 9.2789 4.1613 3.6134 4.8174 6.2349 5.4702 6.9604 7.1390 7.7941 7.3466 3.3460 7.3090 5.4855 3.5333 4.4498 1.5612 9.5908 1.3273 4.9398 2.0858 1.6485 1.3704 2.7900 7.1765 1.2804 1.4851 2.0312 4.7695 4.2391 2.0532 3.5705 1.3232 1.4157 2.9262 2.0501 1.8440 1.9126 1.6214 1.7908 2.4330 1.5999 2.2222 2.2774 2.8611 2.9712 3.2721 2.4888 1.3083 1.9950 1.4591 6.7548 1.1558 2.0688 3.1651 2.5456 1.4026 1.4410 1.5528 1.3857 1.4781 1.6114 1.2666 2.0505 1.4182 2.7811 1.2858 1.5135 3.3298 3.9393 4.1119 3.1039 1.2257 1.3392 4.0197 1.0766 1.0914 2.1271 1.0749 1.0935 1.1223 2.3991 1.0526 1.0694 4.0527 1.6089 5.4551 5.8587 6.6770 6.7718 6.8686 1.0364 1.0662 1.0378 1.0574 1.0609 1.0841 1.0996 1.1073 1.0971 1.0999 1.0989 1.0987 1.0992 1.0891 1.0924 1.0906 1.0964 1.0963 1.0948 1.0922 1.0778 1.0799
irintensity: 1.1502 1.1660 0.2807 0.6121 0.2865 0.3725 0.4371 0.8297 0.6490 1.4726 6.4534 0.7688 1.8103 0.3189 2.7434 0.6479 0.6981 5.2330 6.8709 4.3486 5.4621 2.3527 2.3065 7.1373 6.2138 1.2592 1.9330 7.8522 12.8618 2.7361 6.6251 3.8207 12.2393 2.7652 2.2361 9.1884 5.1227 2.1644 0.7650 7.5312 1.2357 72.2093 29.5927 9.2311 2.7886 159.8792 20.8974 18.3095 34.7127 12.0671 1.6772 14.8102 15.6896 4.9999 1.3681 10.3592 28.0507 7.1086 6.9970 20.1419 17.8162 45.4496 5.5808 10.3807 46.9801 108.7890 28.7485 90.2766 9.2708 22.6333 20.6017 37.6736 5.1673 24.2554 57.7976 12.8730 21.2871 21.9686 2.7335 4.2522 5.7333 5.2635 3.8938 31.2747 17.0819 14.6089 15.1229 2.8982 58.7155 27.6743 2.3861 7.9205 8.2161 23.4159 402.5134 39.9991 476.0833 16.1599 89.5988 36.1547 23.5503 12.3757 16.4525 75.2609 41.8122 5.9671 95.7349 1.5331 128.2299 3.9933 43.4547 27.1203 5.5390 35.4886 17.4030 18.0193 16.8407 7.1255 7.6120 23.1672 14.9694 15.7745 22.5298 18.7022 13.9943 12.5122 21.0733 144.6944 193.5370 109.8526 28.6411 0.3072 118.5017 518.0048 22.9425 26.8202 17.9776 17.8005 35.8943 17.6493 6.2951 16.9624 11.7411 59.4679 22.7045 43.4139 17.6225 9.4503 13.6313 4.9074 4.3076 20.1609 3.1075 16.8889 121.8924 207.2397
temp: 298.150 k
press: 1.00000 atm
elementType: 16 8 8 8 8 8 8 8 8 7 7 7 7 6 6 6 6 6 6 6 6 6 6 6 6 6 6 6 6 6 6 6 1 1 1 1 1 1 1 1 1 1 1 1 1 1 1 1 1 1 1 1 1 1
symmnumber: 1
zpe: 1052797.2 jmol-1
zpe.correction: 0.400989 hartree
zpe.thermalcorrener: 0.431835 hartree
zpe.thermalcorrenthalpy: 0.432779 hartree
zpe.thermalcorrgfe: 0.335253 hartree
zpe.sumelectzpe: -1953.407129 hartree
zpe.sumelectthermal: -1953.376283 hartree
zpe.sumelectthermalent: -1953.375339 hartree
zpe.sumelectthermalfe: -1953.472865 hartree
dipole: 9.2163 0.7154 -3.3358
dipole: 9.8275
quadrupole: -235.9736 -196.9432 -194.0208
quadrupole: -19.4804 -30.4367 6.6365
quadrupole: -26.9944 12.0360 14.9584 -19.4804 -30.4367 6.6365
hfenergy: -1953.8081182 hartree
pointgroup: C01 [X(C19H22N4O8S1)]
dipole: 3.0264833 2.1034561 -1.1684194 debye
polarizability: 411.1534756|52.2992273|359.2588081|-24.3337628|42.1123449|224.1526745 unknown
InChI: InChI=1S/C19H22N4O8S/c1-3-10-20-19(24)17(12-31-32(29,30)15-7-4-13(2)5-8-15)21-16-9-6-14(22(25)26)11-18(16)23(27)28/h4-9,11,17,20-21H,3,10,12H2,1-2H3
charge 0 multiplicity 1
54 atoms
S  2.687134 1.271827 2.042426
O  0.998429 1.592718 1.176736
O  -3.079181 2.616066 0.182643
O  2.359366 0.163208 3.17689
O  3.318137 2.703379 2.444478
O  -0.386314 -4.031964 -0.501085
O  0.428378 -2.003615 0.131198
O  -6.606604 -3.275175 -0.458765
O  -5.072393 -4.893541 -0.960845
N  -1.217647 -0.082109 0.804848
N  -0.842682 2.802746 -0.492485
N  -0.578462 -2.813071 -0.130636
N  -5.389591 -3.702547 -0.569559
C  -1.408455 1.260604 1.369501
C  -0.127877 1.660879 2.134666
C  -1.849921 2.305739 0.292076
C  -2.215744 -0.948486 0.453411
C  -1.066898 3.797224 -1.556856
C  -1.936267 -2.300982 0.000611
C  -0.423819 5.168401 -1.240834
C  3.585891 0.55575 0.570602
C  -3.601285 -0.559041 0.519104
C  -2.977655 -3.196473 -0.330168
C  -4.622505 -1.446338 0.196093
C  -4.304226 -2.76916 -0.22505
C  4.503018 1.390396 -0.088487
C  3.315496 -0.772259 0.199866
C  1.112831 5.114188 -1.088931
C  4.970181 -0.493771 -1.613355
C  5.198088 0.842425 -1.189007
C  4.023337 -1.285541 -0.906217
C  5.723886 -1.075705 -2.793019
H  -2.236251 1.245427 2.103859
H  0.055922 0.94749 2.962373
H  -0.229862 2.686728 2.532761
H  -0.252914 -0.420611 0.646331
H  0.116523 2.500967 -0.269692
H  -2.159597 3.899049 -1.672617
H  -0.654183 3.401485 -2.506362
H  -0.881737 5.576612 -0.319694
H  -0.69035 5.860473 -2.063782
H  -3.847372 0.475249 0.777947
H  -2.739986 -4.210462 -0.661263
H  -5.671643 -1.143291 0.243524
H  4.677053 2.415924 0.251911
H  2.585144 -1.3895 0.729812
H  1.419013 4.487384 -0.230057
H  1.526716 6.12408 -0.91889
H  1.589033 4.705265 -2.000838
H  5.925962 1.463595 -1.721996
H  3.827207 -2.315355 -1.223943
H  6.361273 -0.322096 -3.284431
H  5.028212 -1.481622 -3.549979
H  6.374189 -1.911165 -2.472728
