program: Gaussian 09
title: 000272345
version: EM64L-G09RevD.01
frameworkgroup: C1[X(C19H13N3O)]
method: RPBEPBE
basis: SDD
operation: Freq
keyword: #p
keyword: freq=noraman
keyword: PBEPBE/SDD
title: #p freq=noraman PBEPBE/SDD
converged: YES YES NO NO
title: Mulliken charges:
elementType: O N N N C C C C C C C C C C C C C C C C C C C H H H H H H H H H H H H H
charge: -0.259597 -0.480927 -0.116146 -0.000727 0.363597 -0.051737 0.191800 0.235742 -0.414022 -0.056883 0.420645 0.344860 -0.326601 -0.348863 -0.421447 -0.369151 -0.362979 -0.383688 -0.274195 -0.225102 -0.247078 -0.245940 -0.236091 0.366018 0.268859 0.225818 0.237320 0.239377 0.306333 0.207296 0.244002 0.237061 0.236310 0.233165 0.229547 0.233426
chargesum: 0.00000
title: Mulliken charges with hydrogens summed into heavy atoms:
elementType: O N N N C C C C C C C C C C C C C C C C C C C
charge: -0.259597 -0.114909 -0.116146 -0.000727 0.363597 -0.051737 0.191800 0.235742 -0.145163 -0.056883 0.420645 0.344860 -0.100784 -0.111543 -0.182069 -0.062818 -0.155684 -0.139686 -0.037134 0.011208 -0.013913 -0.016393 -0.002666
polarizability: 4.55094512e+02 4.40903190e+00 2.97036772e+02 -1.93496316e-01 7.56498282e-01 8.67606386e+01
1716.lowfreq: -7.3384 -0.0007 -0.0003 -0.0003 2.1857 5.8698 11.4276 22.3267 44.9173
frequency: 10.4112 22.2810 44.9039 67.1993 97.4767 129.5079 140.1903 178.0555 186.4067 189.7778 225.8876 233.8544 254.0429 313.4064 368.8720 373.2801 392.9234 399.1235 429.2053 464.6379 477.8589 504.9241 520.8714 544.3863 558.5637 602.0367 616.3795 642.6479 660.8031 663.7038 690.4034 692.3015 718.4625 751.4188 776.1301 782.8178 790.6377 807.6682 812.1252 827.4134 839.7772 847.0819 861.1290 888.4216 916.7190 936.9813 960.4232 972.0271 984.2207 986.2804 993.3541 999.6595 1010.4305 1018.9365 1026.3439 1035.3761 1068.2142 1085.3009 1108.9119 1147.9654 1170.7111 1177.2742 1187.4713 1201.4729 1205.9588 1232.6299 1245.0744 1273.8975 1284.8746 1297.8760 1331.5940 1343.9266 1369.0594 1373.3363 1383.3175 1403.2391 1411.2632 1422.2776 1438.3977 1457.2869 1459.7468 1502.8019 1524.6135 1544.4321 1561.0725 1576.4912 1582.2561 1612.4675 1627.5689 3122.8068 3129.7396 3132.9470 3137.7962 3143.4194 3144.3895 3153.2199 3162.4201 3164.1287 3167.2928 3215.4661 3262.5250 3475.1256
redmass: 4.9695 4.1721 5.3886 5.8829 5.4841 6.6074 5.6125 5.9579 6.9734 6.2379 5.8183 5.3952 4.9854 6.4198 5.8808 4.7223 7.3850 2.8536 3.4025 5.6627 3.7712 3.6927 7.6505 7.4588 3.1765 6.0073 6.5295 3.5578 6.5473 6.0814 3.3114 1.6996 4.3011 1.3768 6.0740 1.9321 6.0775 2.7236 1.4532 4.0571 1.4017 1.4181 1.2966 1.7764 5.9527 1.4079 1.3774 1.4148 6.2856 1.3615 6.6490 1.3622 4.4286 1.3312 2.3534 2.0840 2.2214 1.6336 1.8714 1.4257 1.2340 1.0811 1.4413 2.8942 1.2534 2.0651 1.9248 2.7746 2.2534 4.5240 1.4755 4.4393 6.3847 3.6898 4.3985 3.0349 4.7189 3.3420 2.0602 3.1218 2.5041 3.3000 5.4158 6.5189 6.1684 6.1364 5.6708 5.7244 6.4398 1.0861 1.0868 1.0877 1.0872 1.0926 1.0915 1.0966 1.0990 1.0985 1.1016 1.0926 1.0965 1.0797
irintensity: 0.9803 0.9554 0.0852 2.0924 0.1130 3.2853 1.6648 0.4359 1.2212 0.9191 0.6885 0.2898 4.6122 0.3133 2.0271 0.1549 7.5893 0.1936 9.8385 1.0514 0.7637 0.6066 2.6863 1.9488 6.4099 9.9972 1.2882 0.2286 4.5129 8.7635 1.4351 68.5852 2.6434 36.2058 7.5491 46.6385 2.5182 4.5850 17.3978 13.3132 10.3802 83.5104 65.7735 3.2191 0.4992 7.9312 1.6382 1.6051 0.9683 0.1257 2.1748 0.2100 4.9938 1.2192 23.5108 9.7362 10.0325 9.0184 95.1476 1.5526 26.1034 2.6416 50.7216 37.3956 3.4221 11.1505 26.9231 299.7857 71.3955 87.9162 0.5733 13.2264 8.4472 73.6616 5.9089 0.1255 14.2433 15.5652 6.2831 39.3172 148.5439 40.1948 62.2165 23.5357 22.2020 20.9000 1.3767 0.5431 8.0674 8.2835 1.6309 4.0061 6.7828 12.9054 12.5328 17.0732 32.3814 38.6203 47.8133 7.9092 5.3801 107.6793
temp: 298.150 k
press: 1.00000 atm
elementType: 8 7 7 7 6 6 6 6 6 6 6 6 6 6 6 6 6 6 6 6 6 6 6 1 1 1 1 1 1 1 1 1 1 1 1 1
symmnumber: 1
zpe: 713358.4 jmol-1
zpe.correction: 0.271704 hartree
zpe.thermalcorrener: 0.289328 hartree
zpe.thermalcorrenthalpy: 0.290272 hartree
zpe.thermalcorrgfe: 0.223575 hartree
zpe.sumelectzpe: -969.708755 hartree
zpe.sumelectthermal: -969.691131 hartree
zpe.sumelectthermalent: -969.690187 hartree
zpe.sumelectthermalfe: -969.756885 hartree
dipole: 3.7464 -5.2320 0.2367
dipole: 6.4393
quadrupole: -96.8901 -135.0339 -139.7356
quadrupole: 12.7304 -0.2532 0.9213
quadrupole: 26.9964 -11.1474 -15.8490 12.7304 -0.2532 0.9213
hfenergy: -969.9804592 hartree
pointgroup: C01 [X(C19H13N3O1)]
dipole: -1.5787444 -0.0382797 1.9810008 debye
polarizability: 453.2238549|19.0240074|88.8202553|11.7835059|15.6255228|296.8478127 unknown
InChI: InChI=1S/C19H13N3O/c23-22-17-12-16(21-18(17)14-7-2-1-3-8-14)19-15-9-5-4-6-13(15)10-11-20-19/h1-12,21H
charge 0 multiplicity 1
36 atoms
O  1.857484 0.227079 -3.950683
N  0.790244 0.340182 0.420864
N  -1.483318 0.39708 1.673109
N  2.426473 0.296145 -2.783385
C  -0.358869 0.254717 -0.396929
C  -1.642904 0.24324 0.32417
C  1.952581 0.366131 -0.311386
C  -2.955124 0.091649 -0.278246
C  0.089135 0.227532 -1.723459
C  1.529109 0.294567 -1.690573
C  -4.105724 0.15546 0.60459
C  3.281224 0.449636 0.30721
C  -3.186183 -0.125801 -1.675441
C  -3.8911 0.336679 2.008767
C  -5.425075 0.026055 0.059975
C  4.457426 0.496495 -0.497164
C  3.424364 0.487251 1.726222
C  -2.585789 0.437823 2.489492
C  -4.483437 -0.253874 -2.17894
C  -5.613755 -0.171109 -1.308156
C  5.728685 0.579781 0.103705
C  4.698644 0.571031 2.320155
C  5.859234 0.618359 1.51198
H  0.645054 0.400094 1.435766
H  -0.475448 0.187347 -2.648946
H  -2.345442 -0.209401 -2.363326
H  -4.743395 0.388342 2.693758
H  -6.283526 0.080289 0.739404
H  4.349091 0.46536 -1.585734
H  2.545673 0.448229 2.380876
H  -2.379546 0.561961 3.557338
H  -4.636247 -0.42261 -3.250135
H  -6.62431 -0.270291 -1.71869
H  6.621424 0.614943 -0.530059
H  4.788092 0.598416 3.411554
H  6.850055 0.68361 1.974714
