program: Gaussian 09
title: 000272357
version: EM64L-G09RevD.01
frameworkgroup: C1[X(C23H15Cl2NO2)]
method: RPBEPBE
basis: SDD
operation: Freq
keyword: #p
keyword: freq=noraman
keyword: PBEPBE/SDD
title: #p freq=noraman PBEPBE/SDD
converged: YES YES NO NO
title: Mulliken charges:
elementType: Cl Cl O O N C C C C C C C C C C C C C C C C C C C C C C C H H H H H H H H H H H H H H H
charge: -0.052035 -0.041744 -0.281699 -0.259629 -0.001679 -0.280820 0.050045 0.188283 0.768325 0.432118 -0.359999 -0.362405 -0.281901 -0.331005 -0.416112 -0.386170 -0.277969 -0.225445 -0.247927 -0.250104 0.227618 -0.221958 0.210132 -0.346839 -0.336266 -0.222379 -0.220701 -0.221320 0.280375 0.277338 0.233660 0.237395 0.243233 0.234931 0.232632 0.260553 0.259063 0.239555 0.269041 0.282442 0.233718 0.233047 0.232601
chargesum: 0.00000
title: Mulliken charges with hydrogens summed into heavy atoms:
elementType: Cl Cl O O N C C C C C C C C C C C C C C C C C C C C C C C
charge: -0.052035 -0.041744 -0.281699 -0.259629 -0.001679 -0.000445 0.050045 0.188283 0.768325 0.432118 -0.082661 -0.362405 -0.281901 -0.097344 -0.178717 -0.142936 -0.043039 0.007186 0.012626 0.008959 0.227618 0.017597 0.210132 -0.077798 -0.053823 0.011339 0.012346 0.011281
polarizability: 2.87979529e+02 1.78708378e+01 2.95635071e+02 1.03542673e+01 2.02271833e+01 2.56861998e+02
1716.lowfreq: -8.0687 -4.7823 -0.0021 -0.0010 -0.0004 2.3370 16.2151 19.9857 28.0329
frequency: 16.0640 19.9153 27.9805 38.3574 44.5056 53.3140 70.0516 87.9760 107.0870 134.2855 144.5514 154.8468 176.6998 191.4784 196.6719 217.6884 242.3598 260.5025 287.8882 310.9219 362.8281 370.7907 394.1878 403.2636 416.1687 425.4991 438.1756 455.0865 472.2394 488.0337 502.9252 520.3566 525.2665 538.1099 587.7291 613.1211 623.9348 645.4174 665.6140 675.9605 679.1065 701.4643 706.0354 727.8369 761.5424 769.6531 782.2667 787.4910 794.1995 796.5428 806.0954 849.4394 864.3173 865.8104 886.1691 894.5555 900.3792 910.4543 957.7247 967.1514 968.9241 980.4173 990.0959 997.5214 1003.5613 1009.1786 1009.6824 1013.4773 1034.0514 1040.0987 1053.2755 1071.4397 1074.9042 1086.1144 1150.9058 1151.5053 1174.1414 1182.3512 1184.6919 1186.9992 1212.6781 1231.4554 1238.1684 1247.0469 1274.4310 1296.9341 1317.6599 1329.3493 1354.1878 1371.2808 1389.8256 1395.8373 1407.6785 1419.1665 1428.2504 1433.8196 1438.2136 1444.4982 1476.7577 1502.8155 1556.9018 1564.6581 1576.1851 1583.2009 1595.3861 1610.0295 1615.7581 1628.6666 3023.4496 3126.7502 3130.3138 3133.2208 3140.4683 3143.1139 3150.8146 3155.4116 3156.6260 3158.6109 3166.9925 3170.4595 3173.2538 3178.4576 3184.1090
redmass: 7.8815 5.7532 5.0854 7.5777 5.7658 6.3898 8.0347 12.7740 5.1073 8.8916 7.9814 6.0901 4.9810 4.7517 6.1913 8.6678 7.6020 8.6278 6.6448 7.4039 5.9967 8.6060 7.2343 2.8263 4.8205 4.3496 4.1793 5.6981 3.7623 5.2809 8.4428 5.5429 5.4341 4.4493 4.0990 6.4430 5.8280 7.1311 6.3743 4.7531 5.1176 1.6100 4.3294 7.7586 1.2692 2.1446 2.5364 6.0656 3.5158 2.7301 4.3488 1.3243 3.8148 1.2542 2.2243 1.3630 5.7599 4.3141 1.4197 1.3834 1.3321 1.4161 6.1330 1.3908 1.3562 4.7921 1.3835 4.2110 2.3556 2.5949 4.5748 2.5723 2.2553 1.6347 1.3868 1.4994 1.0597 1.1407 1.1507 1.4372 2.1232 2.1466 3.1596 1.8073 1.7064 1.7449 1.3326 1.8251 4.3805 4.0701 9.9602 2.1016 2.4408 3.4533 2.1808 3.2196 2.2426 2.0586 2.2559 2.8870 7.1455 6.4683 6.0435 6.8324 8.2345 6.2624 9.5562 6.2380 1.0818 1.0865 1.0856 1.0871 1.0899 1.0892 1.0875 1.0940 1.0956 1.0984 1.0981 1.0994 1.0930 1.0981 1.0996
irintensity: 0.3995 1.0051 0.0983 0.0428 0.7091 2.2725 2.6994 0.2473 0.1845 0.3543 0.4760 0.1573 0.4239 0.1537 0.5587 0.8044 1.4709 1.2692 15.0001 4.9422 0.9160 9.4428 2.5937 0.0524 4.8369 4.6330 5.0893 7.6722 1.6221 5.9097 3.4967 1.8558 0.2344 5.1750 4.4192 0.4897 20.1007 6.2839 3.0235 8.8337 15.3307 93.2585 12.5781 61.2226 41.9921 28.0180 23.6620 2.9918 20.4524 13.0335 16.6798 59.4001 7.9385 0.1059 26.9289 0.2095 77.1156 24.3369 4.4675 1.5597 0.2810 4.6632 1.7199 0.2754 2.4887 5.0693 0.8303 201.9294 7.0141 129.9958 49.0971 9.2762 2.1159 15.1012 2.6612 9.6936 1.3864 19.3427 41.7021 11.3955 13.9468 23.0981 260.7336 10.2300 12.4707 23.6825 3.2979 43.8006 15.1697 4.5244 3.3144 20.3971 8.0239 11.7505 17.6498 6.0812 17.4003 2.2597 6.2980 13.3855 22.2149 27.8235 9.7844 45.6727 29.4638 13.1501 140.4995 2.8524 21.2668 0.9968 0.5257 1.0948 14.9513 10.9864 5.6604 14.6263 16.4118 43.8624 18.3696 18.8438 1.3962 14.4444 8.4474
temp: 298.150 k
press: 1.00000 atm
elementType: 17 17 8 8 7 6 6 6 6 6 6 6 6 6 6 6 6 6 6 6 6 6 6 6 6 6 6 6 1 1 1 1 1 1 1 1 1 1 1 1 1 1 1
symmnumber: 1
zpe: 824300.7 jmol-1
zpe.correction: 0.313960 hartree
zpe.thermalcorrener: 0.337234 hartree
zpe.thermalcorrenthalpy: 0.338179 hartree
zpe.thermalcorrgfe: 0.257899 hartree
zpe.sumelectzpe: -2008.861941 hartree
zpe.sumelectthermal: -2008.838667 hartree
zpe.sumelectthermalent: -2008.837722 hartree
zpe.sumelectthermalfe: -2008.918002 hartree
dipole: 0.5011 1.2495 -1.6294
dipole: 2.1136
quadrupole: -153.2338 -145.4910 -174.9290
quadrupole: -0.0041 2.3691 1.7028
quadrupole: 4.6508 12.3936 -17.0444 -0.0041 2.3691 1.7028
hfenergy: -2009.175901 hartree
pointgroup: C01[X(C23H15Cl2N1O2)]
dipole: -0.070461 0.5932883 -0.5783958 debye
polarizability: 274.8958814|7.5979038|303.21042|0.1252989|27.6030702|262.3702969 unknown
InChI: InChI=1S/C23H15Cl2NO2/c24-18-11-6-12-19(25)20(18)22(28-23(27)16-8-2-1-3-9-16)21-17-10-5-4-7-15(17)13-14-26-21/h1-14,22H
charge 0 multiplicity 1
43 atoms
Cl -0.929124 -2.923593 2.525075
Cl 0.775539 -1.35747 -2.637546
O  0.729711 0.164424 -0.045434
O  1.37708 0.356712 2.196941
N  -2.235753 -1.017328 -1.229862
C  -0.379364 -0.768487 0.350461
C  -1.677686 -0.254395 -0.270884
C  -2.269643 0.980604 0.201424
C  -0.011636 -2.190847 -0.04214
C  -3.496069 1.417646 -0.435813
C  -1.725506 1.77275 1.266156
C  -0.191535 -3.254308 0.881014
C  0.520932 -2.571602 -1.302674
C  -4.051791 0.596353 -1.469979
C  -4.119099 2.635129 -0.008231
C  -3.411003 -0.59166 -1.817175
C  -2.360258 2.950451 1.667979
C  -3.559629 3.390353 1.023539
C  0.14283 -4.593624 0.608717
C  0.873978 -3.898144 -1.615425
C  1.582663 0.605431 0.981746
C  0.686774 -4.911923 -0.652403
C  2.71409 1.410467 0.445288
C  3.602705 2.013801 1.37393
C  2.919373 1.576683 -0.949594
C  4.687492 2.784439 0.909881
C  4.007941 2.348402 -1.40705
C  4.891041 2.953889 -0.481175
H  -0.451711 -0.719112 1.452997
H  -0.814877 1.453791 1.780892
H  -4.977524 0.897278 -1.972531
H  -5.043708 2.958769 -0.500461
H  -3.815566 -1.254144 -2.589224
H  -1.938224 3.544365 2.4858
H  -4.039499 4.319397 1.350217
H  -0.02117 -5.364418 1.366017
H  1.282309 -4.130692 -2.60243
H  0.958685 -5.945936 -0.886483
H  3.426445 1.86471 2.444385
H  2.230871 1.097018 -1.650781
H  5.372839 3.250891 1.625672
H  4.170082 2.477042 -2.482595
H  5.735195 3.552887 -0.841238
