program: Gaussian 09
title: 000272313
version: EM64L-G09RevD.01
frameworkgroup: C1[X(C13H19NO2)]
method: RPBEPBE
basis: SDD
operation: Freq
keyword: #p
keyword: freq=noraman
keyword: PBEPBE/SDD
title: #p freq=noraman PBEPBE/SDD
converged: YES YES NO NO
title: Mulliken charges:
elementType: O O N C C C C C C C C C C C C C H H H H H H H H H H H H H H H H H H H
charge: -0.446644 -0.285603 -0.119353 0.192390 -0.329047 -0.687670 -0.749611 0.275180 -0.350460 0.221617 -0.348531 0.478291 -0.536958 -0.412202 -0.810921 -0.534033 0.186249 0.195519 0.206341 0.216048 0.247603 0.214444 0.227237 0.226731 0.253117 0.259977 0.241956 0.234618 0.348153 0.223441 0.239024 0.229423 0.223977 0.223873 0.245826
chargesum: 0.00000
title: Mulliken charges with hydrogens summed into heavy atoms:
elementType: O O N C C C C C C C C C C C C C
charge: -0.098491 -0.285603 -0.119353 0.192390 0.052721 -0.017678 -0.081199 0.275180 -0.097343 0.221617 -0.088555 0.478291 -0.295002 -0.177584 -0.119033 0.159643
polarizability: 2.44976355e+02 7.75501449e+00 1.69671041e+02 2.13629739e+00 -1.98965569e+00 9.65047452e+01
1716.lowfreq: -8.8269 -7.8865 -3.9909 0.0006 0.0007 0.0010 12.4407 25.1821 53.8351
frequency: 12.3197 24.9238 53.8256 66.5097 92.0734 101.6060 118.4079 176.2191 182.9185 188.4444 199.1459 216.7128 236.0886 244.4585 256.4670 276.7327 326.4122 344.1855 347.8681 381.5522 426.3948 442.5326 484.1335 502.4539 525.8792 567.6290 582.6754 591.1548 638.7383 703.1957 742.4277 760.8543 829.3553 835.7413 860.0153 866.7937 896.8374 906.1310 928.7777 966.5064 976.7821 991.5946 996.3494 1005.0783 1014.2159 1019.2884 1043.5588 1111.1704 1115.5624 1139.9906 1151.3733 1163.5629 1191.0327 1212.1258 1220.1675 1233.4887 1266.1758 1286.1197 1316.2530 1348.4620 1367.4848 1380.6111 1389.4935 1397.1485 1402.1014 1407.7976 1442.6229 1456.9345 1460.2367 1466.5319 1469.5034 1470.9550 1473.8648 1475.1960 1479.4626 1481.6089 1500.6506 1576.5017 1609.5191 1624.7301 2938.2498 2962.6032 2975.2698 2975.8485 2982.5462 3037.0788 3052.2694 3053.8166 3057.1193 3072.0376 3075.5938 3081.5565 3087.4500 3098.4696 3125.1174 3132.9778 3149.6813 3162.4445 3356.0788
redmass: 3.6876 1.0442 3.5262 4.6124 3.1552 2.9972 4.5550 3.1164 2.1695 2.6397 2.1336 1.5142 2.4628 1.1979 1.4971 2.1801 2.4129 3.0608 2.8426 3.9047 3.0336 2.8581 4.2611 3.7176 5.4430 3.1391 4.0399 3.5032 1.2347 5.8874 3.3087 4.4717 1.3489 3.0109 1.4795 2.7485 2.2394 4.2525 1.4118 1.4011 1.4044 2.3020 2.0770 2.1611 2.2086 1.5524 1.5643 1.2607 2.1386 1.4077 1.3589 1.8295 2.8591 2.0151 2.0202 1.8216 4.6690 1.6036 1.3083 1.8419 1.2152 1.3312 2.1083 1.2250 1.3013 2.5967 1.2838 1.0576 1.0505 1.0512 1.1155 1.0933 1.0834 1.0890 1.0550 1.0584 2.7505 6.9693 6.3140 6.8210 1.0678 1.0327 1.0390 1.0353 1.0350 1.0870 1.1041 1.0954 1.0945 1.0994 1.0997 1.0995 1.0999 1.0998 1.0997 1.0887 1.0903 1.0953 1.0634
irintensity: 0.4502 0.3995 2.3482 1.4294 3.3795 4.3752 6.7563 4.1389 0.7659 1.9141 1.1956 0.1575 0.7447 0.1265 0.0187 1.6889 1.3577 0.2245 2.8040 14.3185 4.1074 7.4151 3.2622 2.0735 8.3819 3.9452 2.7178 12.6487 138.4747 4.2341 0.6106 5.0686 44.2658 19.7452 4.2260 3.4830 8.1785 7.6209 0.6475 1.2441 1.7458 18.6609 40.6883 57.0288 28.9801 2.6659 23.2619 0.3997 38.6595 83.2828 0.4805 48.7605 35.2533 13.0097 13.6338 13.5773 105.1920 31.1794 15.5542 7.1755 28.5807 31.2971 16.6460 10.2592 87.9073 69.5785 10.9920 3.6081 1.4892 14.3437 74.7810 1.9854 20.3639 2.2455 21.0242 6.0702 10.7182 24.7801 185.5834 47.6649 91.8137 69.2489 37.3123 21.0728 30.5354 21.8694 41.9717 42.3250 23.2351 14.4402 30.7697 77.5892 18.1356 15.7383 21.2539 10.5707 16.4236 7.8637 131.0476
temp: 298.150 k
press: 1.00000 atm
elementType: 8 8 7 6 6 6 6 6 6 6 6 6 6 6 6 6 1 1 1 1 1 1 1 1 1 1 1 1 1 1 1 1 1 1 1
symmnumber: 1
zpe: 768101.9 jmol-1
zpe.correction: 0.292555 hartree
zpe.thermalcorrener: 0.310456 hartree
zpe.thermalcorrenthalpy: 0.311401 hartree
zpe.thermalcorrgfe: 0.245053 hartree
zpe.sumelectzpe: -710.725783 hartree
zpe.sumelectthermal: -710.707882 hartree
zpe.sumelectthermalent: -710.706937 hartree
zpe.sumelectthermalfe: -710.773285 hartree
dipole: -4.8051 4.0196 0.0630
dipole: 6.2650
quadrupole: -87.5568 -92.5278 -99.8163
quadrupole: 9.0528 1.2764 -1.5250
quadrupole: 5.7435 0.7725 -6.5160 9.0528 1.2764 -1.5250
hfenergy: -711.018338 hartree
pointgroup: C01 [X(C13H19N1O2)]
dipole: 1.6664964 1.6047293 -0.8503297 debye
polarizability: 245.6920318|1.1506893|157.0192214|-2.9548869|-26.9538547|108.440888 unknown
InChI: InChI=1S/C13H19NO2/c1-10-5-6-11(12(7-10)16-4)8-14-13(2,3)9-15/h5-8,15H,9H2,1-4H3
charge 0 multiplicity 1
35 atoms
O  -3.46933 -2.103319 1.441038
O  1.114832 2.112974 -1.079782
N  -1.825976 -0.465389 0.131859
C  -3.271976 -0.103891 -0.019569
C  -3.943714 -0.738531 1.243432
C  -3.786862 -0.818429 -1.298451
C  -3.580272 1.409065 -0.074531
C  0.552973 -0.019733 -0.128391
C  -0.87237 0.339013 -0.255473
C  1.569539 0.89274 -0.552396
C  0.966609 -1.267265 0.405147
C  3.332639 -0.69376 0.102957
C  2.938873 0.555092 -0.438518
C  2.326964 -1.605104 0.519946
C  4.80396 -1.036075 0.255366
C  2.112822 3.08259 -1.536789
H  -3.714459 -0.105682 2.129327
H  -5.039143 -0.792089 1.112385
H  -4.862448 -0.607351 -1.443457
H  -3.23568 -0.469239 -2.190129
H  -3.655681 -1.909832 -1.203062
H  -3.235397 1.869224 -1.018575
H  -3.108247 1.946803 0.768755
H  -4.672719 1.56573 -0.011874
H  -1.067869 1.330934 -0.698177
H  0.184973 -1.965142 0.721632
H  3.712683 1.255672 -0.768425
H  2.617169 -2.577782 0.9329
H  -2.500451 -2.047822 1.185991
H  5.422482 -0.534846 -0.509847
H  5.182745 -0.717576 1.246341
H  4.973573 -2.123967 0.175485
H  2.724381 2.671084 -2.36284
H  2.77299 3.401714 -0.707343
H  1.531087 3.942687 -1.899433
