program: Gaussian 09
title: 000272299
version: EM64L-G09RevD.01
frameworkgroup: C1[X(C11H14FNO)]
method: RPBEPBE
basis: SDD
operation: Freq
keyword: #p
keyword: freq=noraman
keyword: PBEPBE/SDD
title: #p freq=noraman PBEPBE/SDD
converged: YES YES NO NO
title: Mulliken charges:
elementType: F O N C C C C C C C C C C C H H H H H H H H H H H H H H
charge: -0.199267 -0.441973 -0.107099 0.179978 -0.327182 -0.748162 -0.681855 -0.351820 0.443823 -0.345491 -0.335432 -0.368915 -0.359450 0.327266 0.200403 0.189011 0.232542 0.213093 0.226713 0.249591 0.209981 0.215141 0.214107 0.347244 0.232940 0.265378 0.259374 0.260062
chargesum: 0.00000
title: Mulliken charges with hydrogens summed into heavy atoms:
elementType: F O N C C C C C C C C C C C
charge: -0.199267 -0.094730 -0.107099 0.179978 0.062232 -0.075815 -0.007143 -0.137712 0.443823 -0.112551 -0.070054 -0.109540 -0.099388 0.327266
polarizability: 2.10305279e+02 5.24215416e-01 1.26663992e+02 1.80311109e+00 4.48120853e+00 7.64783632e+01
1716.lowfreq: -7.7802 -2.2449 0.0008 0.0010 0.0012 10.1183 27.8180 57.6981 71.4839
frequency: 27.7602 57.6747 71.4596 107.8200 128.3148 195.1255 206.0815 216.1974 223.9781 253.4448 281.2091 328.8710 358.0508 365.4737 416.5127 423.5009 427.7777 464.3124 529.0168 542.7162 555.6679 607.5637 627.7876 724.7334 743.1981 783.6278 819.5202 840.7542 851.7090 866.4846 894.8254 928.3340 943.5213 967.5419 976.3630 986.6883 1001.8568 1003.3959 1019.1265 1101.9022 1136.7743 1154.0038 1190.1377 1192.8515 1213.5001 1227.1714 1244.0252 1288.6049 1313.8664 1348.6720 1369.1944 1382.0232 1389.3801 1402.8850 1411.4916 1455.5795 1462.1231 1474.6249 1481.0775 1483.2641 1494.4186 1591.7182 1608.6634 1629.8811 2941.2988 2965.6800 2977.8080 2986.1600 3060.1958 3071.8070 3077.3016 3085.0595 3102.4819 3129.6042 3160.1699 3177.4936 3180.9020 3401.3532
redmass: 3.7487 5.5719 5.7819 3.0545 4.4060 3.5432 2.0578 1.9009 2.4720 1.1278 2.3299 2.4659 3.6649 4.9038 2.9428 3.5640 3.6319 3.2138 2.8502 4.1250 2.6295 1.3958 7.1068 3.6819 5.0500 4.7434 1.2707 1.4977 4.0110 2.8087 2.1432 1.4089 1.3430 1.4152 1.3952 1.7018 2.7654 2.7917 1.5682 1.2954 1.4027 1.3347 2.9357 2.1083 2.7525 2.1451 2.2883 1.3380 1.3166 1.8208 1.2212 1.2429 2.0383 1.6098 3.2313 1.0565 1.0513 1.0860 1.0551 1.0612 2.7292 8.1447 6.3331 7.3183 1.0682 1.0805 1.0402 1.0352 1.0953 1.0996 1.0994 1.0996 1.0998 1.0903 1.0883 1.0955 1.0973 1.0636
irintensity: 0.1844 0.2463 2.1627 5.5617 3.7605 0.0682 0.2040 0.1156 0.6574 0.1090 1.8990 2.7180 4.7003 10.2502 0.3551 4.8912 5.5687 5.9940 15.9940 21.2015 23.4653 130.2772 0.6643 1.1567 15.6438 0.9134 9.9858 72.0099 20.2149 3.7302 8.0675 0.4773 4.8145 2.4843 1.3850 20.3523 38.4414 43.1106 5.3036 12.4298 73.3114 44.5280 50.1441 8.7397 40.3834 31.1760 10.7959 9.1041 29.0147 1.2873 28.7274 17.8365 23.4640 46.9112 9.6290 3.9266 0.6223 5.0543 10.4067 26.0245 80.7152 22.1890 100.1134 50.4152 84.6325 24.2926 40.6103 30.0558 30.4275 26.7500 22.0466 66.5356 14.8441 9.7516 1.3366 3.9680 4.4625 84.4735
temp: 298.150 k
press: 1.00000 atm
elementType: 9 8 7 6 6 6 6 6 6 6 6 6 6 6 1 1 1 1 1 1 1 1 1 1 1 1 1 1
symmnumber: 1
zpe: 592947.9 jmol-1
zpe.correction: 0.225842 hartree
zpe.thermalcorrener: 0.239942 hartree
zpe.thermalcorrenthalpy: 0.240886 hartree
zpe.thermalcorrgfe: 0.184431 hartree
zpe.sumelectzpe: -656.315463 hartree
zpe.sumelectthermal: -656.301363 hartree
zpe.sumelectthermalent: -656.300419 hartree
zpe.sumelectthermalfe: -656.356874 hartree
dipole: 0.2695 -3.9505 0.0124
dipole: 3.9597
quadrupole: -93.1364 -81.7012 -85.4280
quadrupole: -8.3675 0.3842 1.9743
quadrupole: -6.3812 5.0540 1.3272 -8.3675 0.3842 1.9743
hfenergy: -656.5413049 hartree
pointgroup: C01 [X(C11H14F1N1O1)]
dipole: -0.0355799 -1.5409019 0.226448 debye
polarizability: 210.2084048|3.270959|124.3827304|0.1248543|-11.6150243|78.8564981 unknown
InChI: InChI=1S/C11H14FNO/c1-11(2,8-14)13-7-9-3-5-10(12)6-4-9/h3-7,14H,8H2,1-2H3
charge 0 multiplicity 1
28 atoms
F  4.990871 0.776678 -0.184489
O  -3.246108 2.036416 0.067664
N  -1.464263 0.027585 -0.036579
C  -2.890212 -0.426107 0.037905
C  -3.630429 0.781177 0.702014
C  -3.139461 -1.710187 0.860147
C  -3.380916 -0.601569 -1.424834
C  -0.466254 -0.787953 0.15379
C  0.945336 -0.357313 0.061056
C  1.975906 -1.305075 0.305367
C  1.299826 0.980792 -0.269603
C  3.335573 -0.937272 0.226738
C  2.649963 1.367438 -0.353208
C  3.638332 0.395122 -0.101511
H  -4.722223 0.679548 0.572801
H  -3.393377 0.794828 1.788741
H  -4.226886 -1.860401 0.987534
H  -2.742035 -2.610671 0.356588
H  -2.685266 -1.640888 1.866286
H  -3.293535 0.351896 -1.972529
H  -4.441779 -0.911493 -1.431119
H  -2.785695 -1.370969 -1.948588
H  -0.611016 -1.860424 0.398049
H  -2.264517 1.932608 -0.097286
H  1.711776 -2.338709 0.55963
H  0.499884 1.702293 -0.460099
H  4.141148 -1.653162 0.411849
H  2.943356 2.390314 -0.606114
