program: Gaussian 09
title: 000272297
version: EM64L-G09RevD.01
frameworkgroup: C1[X(C11H14FNO)]
method: RPBEPBE
basis: SDD
operation: Freq
keyword: #p
keyword: freq=noraman
keyword: PBEPBE/SDD
title: #p freq=noraman PBEPBE/SDD
converged: YES YES NO NO
title: Mulliken charges:
elementType: F O N C C C C C C C C C C C H H H H H H H H H H H H H H
charge: -0.206668 -0.442677 -0.108275 0.182039 -0.327914 -0.746977 -0.682345 -0.327872 0.249146 0.199441 -0.329838 -0.362103 -0.234846 -0.191191 0.200176 0.189635 0.230886 0.217062 0.227814 0.248412 0.210241 0.217075 0.243994 0.346933 0.265443 0.258247 0.235821 0.238342
chargesum: 0.00000
title: Mulliken charges with hydrogens summed into heavy atoms:
elementType: F O N C C C C C C C C C C C
charge: -0.206668 -0.095744 -0.108275 0.182039 0.061897 -0.071215 -0.006617 -0.083877 0.249146 0.199441 -0.064395 -0.103856 0.000975 0.047150
polarizability: 2.02884870e+02 -6.78749331e+00 1.30255448e+02 -1.60935890e+00 -2.90305900e+00 7.62465937e+01
1716.lowfreq: -8.6407 -1.2465 -0.0008 -0.0008 -0.0001 5.2433 20.0221 68.6751 77.4329
frequency: 19.6332 68.6723 77.4080 111.2118 128.0963 195.4579 204.6451 211.6884 224.0097 249.5046 270.2616 295.8677 328.3305 362.3633 423.9925 437.8158 483.9781 485.7119 511.3989 544.5094 564.6330 592.7972 618.7860 728.9934 743.4168 768.9752 796.8247 853.6471 866.8043 868.9079 895.2858 930.3068 955.9329 968.0317 988.0080 995.5334 1003.5030 1019.4428 1027.4526 1083.4035 1137.5728 1165.4002 1171.1531 1191.4058 1213.4020 1224.3545 1236.2643 1282.0159 1316.1900 1356.5321 1369.6441 1381.9045 1390.8986 1404.1127 1441.4896 1457.1617 1460.8936 1470.3321 1475.2965 1481.0161 1483.3032 1578.3209 1617.7558 1625.6412 2942.7508 2977.6327 2985.6306 3026.9803 3060.3589 3074.2777 3077.4053 3085.0565 3101.2720 3142.2255 3157.0135 3170.9551 3182.0311 3399.9230
redmass: 4.8425 4.1843 4.6090 3.0109 4.7720 2.9262 2.6219 1.8868 2.6251 1.1064 2.4740 3.0091 2.4570 3.7147 3.5931 2.8742 3.7119 3.5645 6.6003 3.7138 2.7534 2.3634 2.0638 3.8663 5.2960 1.2534 4.6008 4.3865 2.2252 1.5463 2.1876 1.3997 1.3508 1.4214 1.6090 1.5478 2.4518 1.5697 1.9857 2.5905 1.4005 1.1992 1.7214 2.9350 2.4592 2.1788 1.8818 1.7793 1.3013 1.8062 1.2331 1.2322 1.9249 1.6139 2.4759 1.0582 1.0510 2.4456 1.1185 1.0633 1.0684 6.8030 7.0657 6.9976 1.0680 1.0357 1.0350 1.0870 1.0955 1.0997 1.0993 1.0996 1.0999 1.0862 1.0906 1.0956 1.0993 1.0636
irintensity: 1.8400 1.2059 3.1277 5.4287 5.0067 1.7541 1.2529 0.2929 0.1721 0.0578 1.6098 3.9745 1.3763 2.3432 6.1761 5.5972 1.6959 6.8952 7.1526 0.9951 17.3658 72.0053 72.4986 0.2700 13.7912 98.6843 14.6062 10.5181 0.9328 0.9083 7.2144 0.4201 0.5193 2.8782 17.0613 16.0046 64.5717 4.5250 6.1760 27.6107 55.8704 6.3695 15.3024 29.5038 13.3656 3.3118 23.5151 29.3346 20.1714 5.4458 30.0271 15.1879 22.5770 58.6855 43.6655 4.2173 0.7206 32.9365 1.2323 22.2858 6.3219 16.1074 44.9661 45.0150 85.4453 19.9490 26.6290 24.7026 30.9783 23.3621 22.1377 64.8628 14.9127 1.4369 7.3859 11.3728 10.2677 83.7263
temp: 298.150 k
press: 1.00000 atm
elementType: 9 8 7 6 6 6 6 6 6 6 6 6 6 6 1 1 1 1 1 1 1 1 1 1 1 1 1 1
symmnumber: 1
zpe: 593472.3 jmol-1
zpe.correction: 0.226042 hartree
zpe.thermalcorrener: 0.240154 hartree
zpe.thermalcorrenthalpy: 0.241098 hartree
zpe.thermalcorrgfe: 0.184542 hartree
zpe.sumelectzpe: -656.314398 hartree
zpe.sumelectthermal: -656.300285 hartree
zpe.sumelectthermalent: -656.299341 hartree
zpe.sumelectthermalfe: -656.355897 hartree
dipole: 2.2552 1.4282 0.2238
dipole: 2.6788
quadrupole: -75.1556 -87.1849 -85.5342
quadrupole: -15.8703 -0.4091 -1.3164
quadrupole: 7.4693 -4.5600 -2.9093 -15.8703 -0.4091 -1.3164
hfenergy: -656.5404392 hartree
pointgroup: C01 [X(C11H14F1N1O1)]
dipole: 0.8991724 -0.546276 0.0615471 debye
polarizability: 202.5067938|8.8928618|126.0673742|1.7068608|-15.1623607|80.8127438 unknown
InChI: InChI=1S/C11H14FNO/c1-11(2,8-14)13-7-9-5-3-4-6-10(9)12/h3-7,14H,8H2,1-2H3
charge 0 multiplicity 1
28 atoms
F  2.139462 -2.147952 0.80449
O  -3.182585 1.975844 -0.075458
N  -1.232496 0.129227 -0.01941
C  -2.613548 -0.441382 0.086308
C  -3.46249 0.74407 0.653174
C  -2.757651 -1.676295 1.002559
C  -3.073508 -0.767571 -1.360785
C  -0.171421 -0.586206 0.228432
C  1.189188 -0.021874 0.101829
C  2.329951 -0.808489 0.391289
C  1.426419 1.318875 -0.312592
C  3.647421 -0.336448 0.292627
C  2.735304 1.825508 -0.422349
C  3.847672 0.999714 -0.119717
H  -4.539816 0.536979 0.528751
H  -3.23826 0.862174 1.736178
H  -3.828995 -1.910012 1.139864
H  -2.27963 -2.574476 0.57062
H  -2.318834 -1.491847 2.000923
H  -3.064301 0.145675 -1.979589
H  -4.10366 -1.167881 -1.345754
H  -2.410057 -1.520304 -1.823054
H  -0.217913 -1.643623 0.54494
H  -2.194422 1.943346 -0.230855
H  0.555896 1.940071 -0.544169
H  4.482925 -0.999905 0.532797
H  2.895433 2.859982 -0.742637
H  4.866315 1.392099 -0.204417
