program: Gaussian 09
title: 000272290
version: EM64L-G09RevD.01
frameworkgroup: C1[X(C13H16ClNO)]
method: RPBEPBE
basis: SDD
operation: Freq
keyword: #p
keyword: freq=noraman
keyword: PBEPBE/SDD
title: #p freq=noraman PBEPBE/SDD
converged: NO YES NO NO
title: Mulliken charges:
elementType: Cl O N C C C C C C C C C C C C C H H H H H H H H H H H H H H H H
charge: -0.063983 -0.255435 -0.098298 -0.058506 -0.433662 -0.437860 -0.224008 -0.395293 -0.390555 -0.388803 0.514866 -0.394072 -0.358755 -0.086197 -0.207078 -0.230370 0.209447 0.205449 0.228098 0.207055 0.215398 0.217175 0.206506 0.194237 0.194177 0.206053 0.202945 0.193402 0.257841 0.276844 0.235001 0.258380
chargesum: 0.00000
title: Mulliken charges with hydrogens summed into heavy atoms:
elementType: Cl O N C C C C C C C C C C C C C
charge: -0.063983 -0.255435 -0.098298 0.150940 -0.000115 -0.015407 -0.006833 0.005451 0.009675 0.007544 0.514866 -0.136231 -0.081911 -0.086197 0.027923 0.028011
polarizability: 2.23645194e+02 1.19929025e+01 1.42299738e+02 6.94944947e+00 -1.46961321e+01 1.13117523e+02
1716.lowfreq: -27.0197 -12.9693 -0.0026 -0.0025 -0.0015 4.0300 14.4915 43.1525 48.3137
frequency: -15.5743 42.8918 47.6457 87.1659 116.7971 163.4858 182.2367 192.9388 216.4682 254.2249 290.7790 330.8340 356.6016 385.8307 405.9161 423.6212 437.1432 463.0126 472.7986 517.8434 590.9481 617.7746 665.7135 689.7443 710.9740 776.6531 787.2225 795.3814 807.6375 842.2626 855.9841 887.5003 889.5681 896.1450 916.2873 919.4306 941.2048 982.6373 984.9139 1028.4123 1046.5741 1051.9954 1070.3476 1078.3250 1090.9306 1094.6762 1108.8621 1150.9608 1154.0975 1175.5095 1191.5311 1234.3212 1240.6459 1252.1303 1260.2206 1287.0114 1296.8217 1311.9653 1326.0279 1334.3916 1340.0372 1341.1313 1350.5271 1366.8510 1389.2782 1438.8454 1461.9824 1463.8042 1464.1117 1470.4870 1472.0553 1479.1277 1580.7888 1611.4286 2925.2725 2969.4600 2970.4865 2971.8293 2981.6883 2988.1106 3032.2020 3034.0477 3035.2188 3040.3535 3047.6265 3059.0483 3145.1987 3148.1641 3169.6021 3179.3783
redmass: 4.5529 4.7954 3.9940 4.6231 3.5582 6.9656 5.3970 4.8090 1.8694 3.0186 5.1511 2.2582 7.2451 4.3263 4.1161 3.1825 3.1752 3.2679 2.9501 2.2196 4.2344 6.4146 8.3899 2.3703 6.0787 2.8096 1.4446 2.4107 1.9638 2.0170 4.3968 1.5914 1.6583 1.6863 1.4190 1.8271 2.7741 1.3556 5.8133 3.1930 1.9387 1.1301 2.1044 1.4497 1.3499 1.4840 2.5495 2.9010 2.4369 1.0853 1.6122 1.6394 1.4069 1.2945 1.2709 1.2192 1.4795 1.3109 1.4276 1.3938 1.4623 1.5446 1.6304 1.6945 4.7269 2.2374 1.0857 1.0881 1.0902 2.6578 1.0829 1.0951 6.4635 6.6495 1.0831 1.0634 1.0663 1.0601 1.0603 1.0623 1.0969 1.0957 1.0888 1.1010 1.1025 1.1022 1.0878 1.0924 1.0928 1.0988
irintensity: 0.2305 1.5508 0.5515 1.9993 0.8133 5.0220 0.2613 0.5673 0.2908 1.1497 4.0322 0.2698 3.9614 4.2652 3.1782 0.3714 2.9843 10.3978 3.9990 1.2130 3.2182 17.0556 32.2762 25.2679 17.1180 74.9376 0.0350 3.8597 8.1531 7.6381 13.9709 10.6160 2.5734 14.3461 0.1983 1.2651 1.2409 0.4645 4.0476 14.3551 1.1668 0.1027 17.5128 0.6766 1.8344 7.5334 0.0689 1.8699 2.2242 2.4538 0.5085 34.2761 5.2067 0.9564 1.9230 3.6237 17.7021 1.0369 2.7984 1.0941 10.2689 21.1770 14.4472 3.4839 2.3282 49.2162 2.5460 11.5882 6.9980 13.2836 22.6751 2.4586 33.6959 9.2569 25.7958 30.9296 38.8965 37.6752 24.3178 19.1571 53.6160 77.2434 32.1123 4.7119 62.5955 59.9739 8.6453 1.5437 1.4817 6.4783
temp: 298.150 k
press: 1.00000 atm
elementType: 17 8 7 6 6 6 6 6 6 6 6 6 6 6 6 6 1 1 1 1 1 1 1 1 1 1 1 1 1 1 1 1
symmnumber: 1
zpe: 685819.8 jmol-1
zpe.correction: 0.261215 hartree
zpe.thermalcorrener: 0.275080 hartree
zpe.thermalcorrenthalpy: 0.276024 hartree
zpe.thermalcorrgfe: 0.219766 hartree
zpe.sumelectzpe: -1093.747425 hartree
zpe.sumelectthermal: -1093.733560 hartree
zpe.sumelectthermalent: -1093.732616 hartree
zpe.sumelectthermalfe: -1093.788874 hartree
dipole: -2.1037 1.2213 1.0515
dipole: 2.6501
quadrupole: -99.4847 -102.9389 -102.7941
quadrupole: -8.5495 3.4755 -6.7110
quadrupole: 2.2545 -1.1997 -1.0548 -8.5495 3.4755 -6.7110
hfenergy: -1094.00864 hartree
pointgroup: C01 [X(C13H16Cl1N1O1)]
dipole: 0.8395356 0.6129341 -0.0808526 debye
polarizability: 218.6041499|-12.4853805|111.9906565|-18.7877372|15.622295|148.4676494 unknown
InChI: InChI=1S/C13H16ClNO/c14-11-6-4-5-10(9-11)13-15(16-13)12-7-2-1-3-8-12/h4-6,9,12-13H,1-3,7-8H2
charge 0 multiplicity 1
32 atoms
Cl -4.832405 0.820141 2.692916
O  0.335501 -2.077672 0.082685
N  0.781053 -0.614492 -0.36799
C  2.177195 -0.354817 0.123297
C  3.18579 -0.976423 -0.862375
C  2.344359 1.183144 0.212339
C  -0.207275 -0.842828 0.717432
C  4.637311 -0.609282 -0.471505
C  3.798232 1.54797 0.603973
C  4.822519 0.924084 -0.373839
C  -1.634543 -0.490315 0.467775
C  -2.444288 -0.06057 1.547586
C  -2.185808 -0.596451 -0.834554
C  -3.79132 0.261707 1.300602
C  -3.5395 -0.270082 -1.052505
C  -4.359854 0.165609 0.017008
H  2.326965 -0.802773 1.132501
H  2.961522 -0.597372 -1.879199
H  3.046477 -2.072967 -0.883043
H  1.630304 1.60728 0.945053
H  2.101901 1.624003 -0.774595
H  0.145366 -0.696776 1.753216
H  5.341328 -1.035935 -1.210881
H  4.884771 -1.070725 0.507047
H  4.005614 1.183621 1.631421
H  3.907585 2.649054 0.627013
H  5.852703 1.166199 -0.049203
H  4.68734 1.373142 -1.379291
H  -2.034022 0.020563 2.55995
H  -1.542235 -0.932975 -1.652495
H  -3.97057 -0.350713 -2.055882
H  -5.411214 0.420147 -0.145157
