program: Gaussian 09
title: 000272293
version: EM64L-G09RevD.01
frameworkgroup: C1[X(C17H12ClN)]
method: RPBEPBE
basis: SDD
operation: Freq
keyword: #p
keyword: freq=noraman
keyword: PBEPBE/SDD
title: #p freq=noraman PBEPBE/SDD
converged: YES YES NO NO
title: Mulliken charges:
elementType: Cl N C C C C C C C C C C C C C C C C C H H H H H H H H H H H H
charge: -0.047250 0.066574 0.260841 0.397309 -0.079405 -0.374479 -0.301270 -0.257452 -0.310844 -0.306011 0.484663 -0.259012 -0.224353 -0.355819 -0.385618 -0.396476 -0.237006 -0.237634 -0.237647 0.224338 0.211354 0.252787 0.268471 0.224700 0.231184 0.236108 0.224972 0.231957 0.229395 0.231763 0.233860
chargesum: 0.00000
title: Mulliken charges with hydrogens summed into heavy atoms:
elementType: Cl N C C C C C C C C C C C C C C C C C
charge: -0.047250 0.066574 0.260841 0.397309 -0.079405 -0.150141 -0.089916 -0.004665 -0.042373 -0.081310 0.484663 -0.027828 0.011755 -0.355819 -0.160646 -0.164519 -0.007611 -0.005871 -0.003787
polarizability: 3.85504520e+02 -1.55563909e+01 2.49719138e+02 -1.16036998e+00 9.90804024e+00 8.23806251e+01
1716.lowfreq: -2.0494 0.0004 0.0007 0.0022 4.7640 7.5259 19.0697 46.4296 50.9863
frequency: 19.0160 46.4249 50.9697 87.8303 97.9870 146.8582 160.5644 187.3876 221.5776 246.7539 266.4859 308.9205 337.2938 401.9444 406.6061 435.2619 485.9297 496.6915 519.9289 527.9592 548.3254 579.7849 600.9794 615.5446 642.2806 653.8969 694.4886 743.1117 765.1479 771.6731 790.9839 830.8381 842.0685 845.0382 863.5383 878.8318 885.8522 894.5019 923.1941 964.4470 973.3051 979.2602 987.9109 997.6264 999.7837 1023.5001 1026.8153 1044.3386 1085.0879 1094.8201 1150.6210 1174.3952 1176.5522 1192.9112 1224.1446 1244.6932 1255.5556 1294.2227 1307.7435 1320.7518 1338.6756 1350.5562 1385.2056 1390.1742 1419.1391 1441.0933 1452.3628 1485.2282 1506.3252 1541.5501 1563.6552 1581.4607 1609.5790 1620.2574 1638.0247 3094.2533 3121.6180 3126.1088 3129.8352 3134.6493 3141.0317 3147.8096 3151.8620 3162.5866 3167.9540 3175.8414 3181.2815
redmass: 3.7565 5.6580 5.4377 5.2120 3.8740 6.4280 4.3663 4.2404 3.1306 7.9169 4.1400 5.5063 13.5003 2.7709 4.4578 3.2699 3.7269 4.5590 3.4864 7.5043 5.5000 7.5025 5.4320 6.4258 6.3720 3.5522 1.6988 5.3347 1.7084 1.5414 2.6575 6.0211 2.2543 1.6462 1.7184 1.5995 2.1382 4.4539 1.4547 1.3597 1.2144 1.3903 5.7886 1.3305 1.3228 2.7691 2.2830 3.0282 1.6281 2.5899 1.4025 1.0702 1.1579 1.1183 2.1624 1.6701 1.9691 1.7191 4.4167 1.5311 1.3912 2.5287 4.9631 4.5581 3.1307 2.3012 3.0109 2.3433 3.7612 7.8531 7.0988 5.5884 5.8944 6.3500 5.2442 1.0899 1.0876 1.0873 1.0863 1.0857 1.0910 1.0894 1.0961 1.0955 1.1015 1.0994 1.0925
irintensity: 0.0524 0.0730 0.1709 0.2979 0.0744 0.0759 1.1607 3.7295 1.4565 0.1113 0.5242 0.8641 12.0683 0.0027 3.8399 3.1344 10.7898 5.1085 0.4518 24.1138 5.7959 21.5386 0.3488 0.0147 1.6424 0.5669 43.1888 2.6125 102.8422 42.1611 3.8102 20.8609 16.9351 7.7419 9.0233 0.7412 29.2988 46.2900 0.9780 0.9063 43.4735 6.9349 1.0198 0.2561 3.0569 0.4078 9.6817 6.5682 4.5373 42.6094 36.7353 1.0928 3.2148 4.6931 18.3454 2.2251 3.0542 5.2796 70.4654 9.5321 10.7832 3.8908 1.8156 0.7851 64.1726 9.0949 7.4394 5.9341 90.6182 142.4928 131.2472 5.2419 0.1371 4.4645 66.6562 9.8832 5.7992 16.6014 4.5752 0.5271 4.7149 17.8537 34.7322 23.8500 35.6217 21.1178 1.7283
temp: 298.150 k
press: 1.00000 atm
elementType: 17 7 6 6 6 6 6 6 6 6 6 6 6 6 6 6 6 6 6 1 1 1 1 1 1 1 1 1 1 1 1
symmnumber: 1
zpe: 618463.8 jmol-1
zpe.correction: 0.235560 hartree
zpe.thermalcorrener: 0.250867 hartree
zpe.thermalcorrenthalpy: 0.251812 hartree
zpe.thermalcorrgfe: 0.190802 hartree
zpe.sumelectzpe: -1168.535024 hartree
zpe.sumelectthermal: -1168.519718 hartree
zpe.sumelectthermalent: -1168.518773 hartree
zpe.sumelectthermalfe: -1168.579783 hartree
dipole: -4.3818 -3.3721 0.0992
dipole: 5.5301
quadrupole: -109.2924 -108.1085 -122.9828
quadrupole: -13.3858 0.4416 3.7185
quadrupole: 4.1688 5.3527 -9.5216 -13.3858 0.4416 3.7185
hfenergy: -1168.7705849 hartree
pointgroup: C01 [X(C17H12Cl1N1)]
dipole: 1.6932365 1.3406087 -0.2633445 debye
polarizability: 386.1289887|-12.871527|238.2956614|-0.286912|-42.122472|93.1796334 unknown
InChI: InChI=1S/C17H12ClN/c18-17-12-14(11-10-13-6-2-1-3-7-13)15-8-4-5-9-16(15)19-17/h1-12H
charge 0 multiplicity 1
31 atoms
Cl -3.029212 -3.676229 0.699175
N  -3.587565 -1.056053 0.297003
C  -1.875201 0.715872 -0.069634
C  -0.819849 -0.283624 0.029444
C  -3.251159 0.27405 0.062012
C  -1.635624 2.112588 -0.274976
C  0.595072 0.081841 -0.136778
C  -1.20847 -1.619189 0.259173
C  -4.319366 1.217772 -0.040809
C  1.660151 -0.657942 0.310012
C  3.087018 -0.349253 0.133753
C  -2.696046 3.019815 -0.369341
C  -4.047757 2.570817 -0.256946
C  -2.591237 -1.918497 0.390925
C  3.564817 0.745753 -0.646241
C  4.047858 -1.18917 0.76882
C  4.945256 0.990029 -0.775378
C  5.430562 -0.944969 0.639714
C  5.886573 0.147772 -0.132878
H  -0.609722 2.48722 -0.343905
H  0.795012 1.025091 -0.658388
H  -0.475844 -2.427578 0.299044
H  -5.340022 0.83761 0.060444
H  1.455069 -1.571565 0.886906
H  -2.489889 4.084215 -0.525443
H  -4.868919 3.291401 -0.334361
H  2.856176 1.403385 -1.161695
H  3.699371 -2.038062 1.370365
H  5.293844 1.834603 -1.380153
H  6.150225 -1.603353 1.138228
H  6.959777 0.340851 -0.237292
