program: Gaussian 09
title: 000272323
version: EM64L-G09RevD.01
frameworkgroup: C1[X(C20H17ClN2O2S)]
method: RPBEPBE
basis: SDD
operation: Freq
keyword: #p
keyword: freq=noraman
keyword: PBEPBE/SDD
title: #p freq=noraman PBEPBE/SDD
converged: YES YES NO NO
title: Mulliken charges:
elementType: Cl S O O N N C C C C C C C C C C C C C C C C C C C C H H H H H H H H H H H H H H H H H
charge: -0.045014 0.912924 -0.538305 -0.517720 -0.541784 -0.112462 -0.048623 0.201656 -0.231732 -0.247764 0.450832 0.192954 -0.356386 -0.375925 -0.290740 -0.313051 -0.229933 -0.798853 -0.236187 0.459237 -0.371739 -0.357562 -0.360910 -0.218378 -0.206131 -0.101578 0.322796 0.278167 0.289747 0.243137 0.243601 0.247733 0.236459 0.231476 0.228998 0.230985 0.243967 0.230125 0.213550 0.233199 0.287149 0.258476 0.263609
chargesum: 0.00000
title: Mulliken charges with hydrogens summed into heavy atoms:
elementType: Cl S O O N N C C C C C C C C C C C C C C C C C C C C
charge: -0.045014 0.912924 -0.538305 -0.517720 -0.218987 -0.112462 -0.048623 0.201656 0.046435 0.041984 0.450832 0.192954 -0.113249 -0.132324 -0.043006 -0.076592 0.001543 -0.094903 -0.006062 0.459237 -0.158189 -0.124363 -0.073761 0.040098 0.057478 -0.101578
polarizability: 5.18787426e+02 -3.25874166e+01 3.48448058e+02 -5.36640512e+00 4.69310226e-01 1.49975974e+02
1716.lowfreq: -6.6607 -2.5294 -0.0026 -0.0018 -0.0016 2.8199 5.1296 8.9205 26.6608
frequency: -2.6503 8.8957 26.6253 31.5977 36.2025 37.4839 45.5199 68.2839 78.4487 101.1072 111.7206 129.9638 149.1615 171.9729 183.4531 192.3142 219.7999 229.0223 258.0453 280.2260 295.8695 302.4343 324.4317 353.2585 379.1329 381.1607 398.8981 407.3627 412.7549 418.7306 456.3439 465.3769 505.2124 513.9686 531.9936 551.7035 568.0693 586.6283 589.1218 622.0297 623.8694 672.2137 708.9135 716.9993 748.5939 759.8485 776.9926 789.9662 799.5190 823.3841 828.5775 843.6992 847.4731 850.5385 854.5909 868.9821 923.8514 944.0515 947.0994 960.3784 963.9306 975.7885 981.1882 983.7150 991.9088 993.9436 995.8238 996.8441 1033.2683 1049.6254 1054.8514 1069.0135 1096.2279 1110.4601 1119.2865 1164.2416 1176.9229 1184.6932 1185.5083 1218.4892 1221.9316 1248.0994 1259.6558 1290.3449 1297.1618 1304.5531 1353.0915 1381.1590 1388.8815 1392.7322 1394.1679 1399.9341 1402.4293 1448.5164 1458.4025 1471.1237 1473.7111 1475.4975 1479.8858 1556.4402 1571.7998 1586.3242 1595.4579 1596.6622 1600.6525 1612.6563 2960.9811 2980.9376 3063.4874 3092.8437 3127.5996 3128.8902 3134.8497 3137.1151 3141.4348 3154.3737 3154.7602 3159.0173 3166.5546 3170.6788 3172.2707 3176.2879 3230.8670
redmass: 6.3684 7.6196 3.7945 5.2978 1.4046 2.4078 5.1966 6.1892 6.4765 5.6352 5.2774 6.3425 5.7982 9.2815 4.7120 8.0935 7.2528 8.3315 5.3154 5.5973 4.4261 4.8872 4.3924 4.3122 4.1369 6.8113 7.1926 2.8802 2.9233 7.5580 3.7996 3.9288 3.2786 3.5471 4.1049 3.9570 5.4504 6.9141 6.1347 6.9585 7.1328 6.3156 3.2672 3.5728 3.6855 1.3254 5.1878 5.6776 10.9690 1.3484 1.3795 3.2293 1.4766 1.2701 3.6904 1.8818 4.6524 1.3853 1.3993 1.6649 1.3151 1.5789 1.3514 1.3953 1.5707 1.5709 3.6672 2.9029 1.9930 1.5931 2.4857 2.8888 2.2279 1.3763 1.2848 1.3419 1.1460 1.3804 1.2666 2.9661 2.0091 2.0721 1.8011 1.3717 1.2653 1.4773 2.6133 6.0570 3.8745 2.9801 2.7640 1.2270 3.2618 2.5206 2.4196 1.0959 2.0341 1.1468 2.7430 5.9787 7.0524 5.8479 6.9120 6.0494 6.1954 6.8543 1.0863 1.0389 1.0949 1.1000 1.0900 1.0859 1.0889 1.0894 1.0891 1.0894 1.0946 1.0959 1.0963 1.1004 1.0954 1.0972 1.0720
irintensity: 1.8792 0.8954 0.7912 0.2856 0.6048 0.1740 0.1533 0.7118 0.5955 2.6185 0.6930 2.2322 8.2698 0.5914 8.2617 12.6882 6.4731 10.4124 5.7267 12.7565 4.5091 4.7663 5.1268 6.4976 5.0131 20.3541 35.6627 1.9315 0.7352 153.9552 20.3306 5.7503 52.3928 42.6221 9.3583 6.4948 0.8059 5.1892 43.3558 0.2702 0.2370 10.2535 0.5986 4.9644 0.2728 60.8267 7.7043 12.2393 78.7444 32.4215 30.0633 15.7135 23.9189 0.7136 19.2845 7.0752 111.1188 12.0544 5.4068 118.8779 1.3391 17.2858 0.8869 2.1050 1.0253 9.6516 1.6354 33.9488 6.7065 27.4730 35.3881 81.7570 14.3637 14.0401 8.4676 4.6474 13.0277 5.6504 15.6759 8.4013 6.5745 15.9981 2.6443 11.1827 2.9498 5.2195 11.8688 0.7766 5.8388 9.5240 4.6028 15.3226 10.1141 0.6324 8.3433 16.5710 30.4347 16.0549 91.3996 38.6184 15.3451 62.7689 0.3045 7.3741 44.9776 30.4254 50.3239 28.9370 18.0822 14.8497 8.2980 4.2579 12.4119 11.1532 2.9286 0.1077 22.6700 7.6060 7.8207 29.9837 5.3846 4.5941 108.0530
temp: 298.150 k
press: 1.00000 atm
elementType: 17 16 8 8 7 7 6 6 6 6 6 6 6 6 6 6 6 6 6 6 6 6 6 6 6 6 1 1 1 1 1 1 1 1 1 1 1 1 1 1 1 1 1
symmnumber: 1
zpe: 834238.7 jmol-1
zpe.correction: 0.317745 hartree
zpe.thermalcorrener: 0.341698 hartree
zpe.thermalcorrenthalpy: 0.342643 hartree
zpe.thermalcorrgfe: 0.260049 hartree
zpe.sumelectzpe: -1888.399201 hartree
zpe.sumelectthermal: -1888.375247 hartree
zpe.sumelectthermalent: -1888.374303 hartree
zpe.sumelectthermalfe: -1888.456897 hartree
dipole: -3.1115 2.9833 -3.8774
dipole: 5.7979
quadrupole: -125.8981 -148.5833 -178.5853
quadrupole: 19.1750 3.7137 3.9016
quadrupole: 25.1241 2.4390 -27.5631 19.1750 3.7137 3.9016
hfenergy: -1888.7169453 hartree
pointgroup: C01 [X(C20H17Cl1N2O2S1)]
dipole: 1.1010621 -0.3274175 -1.970716 debye
polarizability: 503.0385571|38.6618404|337.7455158|-76.0449772|34.8536445|176.4273849 unknown
InChI: InChI=1S/C20H17ClN2O2S/c1-15-6-12-18(13-7-15)26(24,25)23-20-5-3-2-4-19(20)22-14-16-8-10-17(21)11-9-16/h2-14,23H,1H3
charge 0 multiplicity 1
43 atoms
Cl -7.795628 0.082929 2.002808
S  1.276758 0.97595 0.849183
O  0.054234 1.869192 1.462448
O  2.113119 -0.099049 1.747428
N  0.454221 0.109458 -0.751361
N  -1.540134 -1.677079 -0.297637
C  2.534247 2.14128 0.079714
C  0.743999 -1.263679 -0.912367
C  2.080662 3.353353 -0.464314
C  3.884991 1.761441 0.102701
C  4.423307 3.88607 -1.030921
C  -0.319432 -2.223619 -0.747607
C  3.042604 4.222513 -1.022542
C  4.827289 2.650117 -0.461094
C  2.038698 -1.702427 -1.294129
C  -0.052708 -3.59971 -0.984697
C  2.284779 -3.070195 -1.511647
C  5.447309 4.846629 -1.607258
C  1.238985 -4.018899 -1.357773
C  -3.918627 -1.692759 0.187952
C  -2.70315 -2.27502 -0.395227
C  -5.171584 -2.335624 -0.013813
C  -3.871168 -0.496627 0.962351
C  -6.356794 -1.80211 0.532479
C  -5.045837 0.045646 1.514112
C  -6.273534 -0.615939 1.28875
H  -0.556509 0.204025 -0.488162
H  1.018145 3.614072 -0.438814
H  4.184298 0.816591 0.56837
H  2.716398 5.174777 -1.45644
H  5.88962 2.38051 -0.453193
H  2.832748 -0.960854 -1.428371
H  -0.843035 -4.344543 -0.837539
H  3.286534 -3.404748 -1.801023
H  6.363138 4.321128 -1.927856
H  5.043987 5.395847 -2.475891
H  5.745732 5.600244 -0.853045
H  1.440358 -5.083217 -1.520516
H  -2.836109 -3.236774 -0.933161
H  -5.220601 -3.25854 -0.604641
H  -2.904117 -0.011495 1.128923
H  -7.321083 -2.293496 0.376496
H  -5.01301 0.960929 2.11172
