program: Gaussian 09
title: 000272333
version: EM64L-G09RevD.01
frameworkgroup: C1[X(C16H30N2O10P2)]
method: RPBEPBE
basis: SDD
operation: Freq
keyword: #p
keyword: freq=noraman
keyword: PBEPBE/SDD
title: #p freq=noraman PBEPBE/SDD
converged: YES YES NO NO
title: Mulliken charges:
elementType: P P O O O O O O O O O O N N C C C C C C C C C C C C C C C C H H H H H H H H H H H H H H H H H H H H H H H H H H H H H H
charge: 1.341531 1.349650 -0.480490 -0.461588 -0.474798 -0.466281 -0.264511 -0.267266 -0.563965 -0.562841 -0.227780 -0.225434 -0.747287 -0.745193 0.091513 0.096130 -0.314427 -0.327518 -0.321195 -0.341316 -0.722174 -0.719273 -0.325889 -0.383050 -0.311617 -0.319284 0.263639 0.262006 -0.497192 -0.497344 0.198549 0.257761 0.264395 0.202756 0.200607 0.258520 0.264264 0.222706 0.222334 0.241615 0.248315 0.207035 0.242210 0.247638 0.187514 0.210417 0.200431 0.214184 0.234363 0.229655 0.231543 0.244037 0.332899 0.333618 0.256744 0.239177 0.237162 0.257009 0.238911 0.236874
chargesum: 0.00000
title: Mulliken charges with hydrogens summed into heavy atoms:
elementType: P P O O O O O O O O O O N N C C C C C C C C C C C C C C C C
charge: 1.341531 1.349650 -0.480490 -0.461588 -0.474798 -0.466281 -0.264511 -0.267266 -0.563965 -0.562841 -0.227780 -0.225434 -0.414388 -0.411575 0.091513 0.096130 0.141883 0.139633 0.137932 0.145654 -0.009910 -0.022390 0.072043 0.031565 0.152401 0.156296 0.263639 0.262006 0.235891 0.235448
polarizability: 2.98197984e+02 7.90055025e-01 2.73049594e+02 -5.47649951e+00 -8.74855466e-02 2.08404497e+02
1716.lowfreq: -9.6388 -6.7457 -2.6290 -0.0015 -0.0014 -0.0012 2.8838 15.4067 17.0841
frequency: -6.5558 15.2867 16.6951 20.9725 24.1323 34.0605 39.3135 45.7374 56.6265 61.1200 70.2321 88.5717 99.8236 101.1821 105.9574 112.3755 127.7909 140.3792 144.4846 165.2765 170.0814 182.2377 202.1923 207.5726 211.2984 218.3087 222.7060 228.5356 230.0294 238.7402 243.6441 250.4541 258.2470 275.4399 286.4199 289.9565 320.0546 320.9088 330.3923 338.5121 351.4560 383.2297 391.5334 400.7721 403.9413 404.7260 408.4096 421.3321 474.7423 501.6587 504.1865 518.9865 532.5448 536.4246 545.4772 576.4155 578.1052 616.0717 618.5385 667.1016 668.8972 718.5133 719.1981 747.5937 766.7226 767.3032 777.5266 803.9531 840.5819 865.3417 867.8571 901.1009 901.7109 902.8257 929.0172 930.3445 936.6527 937.5886 963.8109 967.6192 969.4343 981.7329 983.3651 1013.7322 1018.4112 1039.3978 1071.1136 1076.1662 1080.1985 1080.8098 1086.4327 1097.0318 1102.9932 1114.7964 1115.3336 1119.5952 1126.4237 1127.7299 1151.3053 1151.4323 1166.4897 1187.2103 1190.2906 1198.9453 1201.1148 1221.0378 1256.7518 1258.6235 1263.6650 1281.7510 1294.5601 1312.0862 1315.0652 1341.3069 1343.7093 1345.9790 1354.5219 1360.7076 1362.1785 1366.7206 1388.9005 1392.5254 1397.0787 1398.6780 1421.7711 1422.1842 1430.5908 1433.0039 1444.8134 1447.3613 1452.9870 1453.0008 1462.8882 1462.9688 1463.0014 1465.7345 1471.7478 1474.8553 1480.4945 1481.4207 1482.5968 1487.1962 1638.0294 1638.6232 2959.8002 2960.8246 2966.7102 2973.8660 2976.8875 2977.6213 2980.6459 2981.3123 2986.9250 3001.5096 3009.3101 3009.9228 3017.5925 3031.5082 3043.4100 3057.5132 3075.4853 3081.3269 3095.1706 3097.0049 3104.3251 3104.7061 3114.0098 3114.6913 3114.8979 3115.4697 3156.5332 3156.9970 3495.0631 3507.5860
redmass: 5.9898 5.5754 5.4876 4.9718 5.7856 5.8663 4.8545 6.2177 5.4316 4.3324 4.6452 3.4158 1.1291 1.1242 2.1874 3.7255 4.4563 4.4470 4.3594 4.3987 4.6143 3.0793 2.2754 1.4112 1.8806 1.1758 4.5470 4.3122 3.3180 3.2879 3.3760 3.7353 3.5400 4.2717 5.9979 5.2002 4.0105 4.0032 2.8581 2.5245 4.1145 4.4997 3.2887 5.0300 5.0282 4.9104 5.6894 7.1685 3.0777 4.1474 4.4707 1.5541 5.9139 5.0739 1.6512 3.8050 3.9890 7.3524 6.7707 8.6810 8.7554 6.5426 6.5474 1.1733 5.3717 5.3727 2.3895 3.2205 1.5853 2.9941 3.0765 2.1844 2.0717 2.2210 3.2337 3.0836 4.5676 4.9489 3.0597 3.1506 4.9008 1.6594 1.6681 1.6686 1.6468 3.7853 5.5750 5.4665 5.7351 5.1847 3.9399 5.8024 3.2899 1.2884 1.2891 2.1063 3.4615 3.3127 1.5115 1.5163 1.2581 1.7029 1.7404 1.5049 1.5187 1.2159 1.9474 1.8674 1.2687 1.0878 1.1661 1.7445 1.6976 1.1982 1.2486 1.2498 1.2411 1.2175 1.2245 1.4476 1.1921 1.1961 1.2380 1.2632 1.1787 1.1742 1.0824 1.0789 1.0950 1.0954 1.0495 1.0494 1.0534 1.0708 1.0580 1.0546 1.0787 1.0542 1.0764 1.0610 1.0604 1.0888 9.6984 9.7449 1.0641 1.0630 1.0646 1.0633 1.0579 1.0600 1.0519 1.0567 1.0444 1.0630 1.0295 1.0293 1.0945 1.0965 1.1001 1.1025 1.0982 1.0987 1.1011 1.1009 1.0985 1.1011 1.0972 1.0977 1.1045 1.1049 1.1053 1.1053 1.0749 1.0753
irintensity: 1.2399 2.3052 1.4262 1.5726 2.3687 1.8559 2.9917 2.1529 1.6795 0.9724 2.5726 0.8423 0.0253 0.2436 0.3348 0.7332 0.3225 5.8236 6.0585 5.6569 2.0715 2.2296 0.0558 0.8488 2.7061 1.3933 2.2954 2.9068 0.5644 0.9031 3.0923 3.3218 0.5401 1.4820 18.7188 10.5571 19.2557 12.8012 2.5686 9.9860 41.1173 51.9230 9.2746 16.0290 15.2881 2.4895 0.0483 13.2644 54.7663 9.5085 6.1627 69.0694 12.2786 34.2846 58.6503 2.1451 0.5526 35.7270 91.4722 136.7133 55.4413 0.1218 0.0343 32.2209 11.0139 6.3111 65.9241 175.3547 8.6372 21.1943 16.8214 24.4544 13.3175 24.4440 5.7157 4.7325 2.4242 2.7765 2.7630 178.0484 281.1069 3.8067 3.3350 36.6679 55.0941 84.3332 83.8724 57.8905 50.9593 17.2553 37.0991 150.3760 60.5923 5.2681 7.1157 47.6500 276.7609 98.7867 60.2566 14.8518 27.3737 89.1722 56.8608 14.9317 12.5129 20.4632 1.9290 3.0030 20.7495 3.2683 1.3862 21.9902 17.1138 2.5302 1.0821 1.1133 0.1767 0.2841 0.4019 0.4744 19.2321 24.6860 25.6432 32.4958 12.8452 10.6966 6.2826 8.6798 19.8071 17.1689 8.3022 23.3050 2.0092 0.8063 19.7855 5.3299 2.7941 21.3304 8.6642 19.0867 21.6890 18.6942 142.4030 149.6357 32.1629 4.0089 17.8104 98.8457 1.9700 12.0395 51.7758 65.2678 81.9553 50.8876 29.0094 28.7280 5.1730 16.3504 17.7294 76.5475 32.9103 26.2814 7.1713 9.1620 5.6995 4.9161 8.2289 6.0391 20.2871 20.2548 11.9514 12.0992 16.4950 17.2166
temp: 298.150 k
press: 1.00000 atm
elementType: 15 15 8 8 8 8 8 8 8 8 8 8 7 7 6 6 6 6 6 6 6 6 6 6 6 6 6 6 6 6 1 1 1 1 1 1 1 1 1 1 1 1 1 1 1 1 1 1 1 1 1 1 1 1 1 1 1 1 1 1
symmnumber: 1
zpe: 1242541.9 jmol-1
zpe.correction: 0.473259 hartree
zpe.thermalcorrener: 0.507858 hartree
zpe.thermalcorrenthalpy: 0.508802 hartree
zpe.thermalcorrgfe: 0.403514 hartree
zpe.sumelectzpe: -2169.455730 hartree
zpe.sumelectthermal: -2169.421131 hartree
zpe.sumelectthermalent: -2169.420187 hartree
zpe.sumelectthermalfe: -2169.525476 hartree
dipole: -1.7549 -5.7415 1.1039
dipole: 6.1044
quadrupole: -260.3619 -173.6330 -202.6813
quadrupole: 11.5331 -13.3853 1.7699
quadrupole: -48.1365 38.5924 9.5441 11.5331 -13.3853 1.7699
hfenergy: -2169.9289893 hartree
pointgroup: C01 [X(C16H30N2O10P2)]
dipole: 0.5937083 2.2961211 0.3784551 debye
polarizability: 297.6460447|1.9628792|273.0914581|8.3756344|-1.7862583|208.9145721 unknown
InChI: InChI=1S/C16H30N2O10P2/c1-15(13(19)23-3)9-25-29(21,26-10-15)17-7-5-6-8-18-30(22)27-11-16(2,12-28-30)14(20)24-4/h17-18H,5-12H2,1-4H3
charge 0 multiplicity 1
60 atoms
P  3.761511 -1.582188 0.525553
P  -4.300169 -1.47648 -0.657865
O  4.143014 -0.2485 1.576639
O  3.503676 -0.834819 -1.028316
O  -4.041234 -0.099232 -1.693212
O  -4.056949 -0.844747 0.946271
O  5.677978 2.235446 0.345247
O  -4.633999 2.874164 -0.679777
O  4.877978 -2.695989 0.451861
O  -5.723545 -2.139838 -0.819475
O  5.076853 1.933733 -1.880422
O  -4.698903 2.342274 1.582469
N  2.150163 -1.972401 1.059003
N  -2.841633 -2.386283 -0.954624
C  3.399992 1.517721 -0.110124
C  -2.972507 1.3047 0.14125
C  3.422607 1.034789 1.362129
C  2.757964 0.4474 -1.031784
C  -2.923455 0.809217 -1.326914
C  -2.939662 0.113828 1.135338
C  2.533198 2.811165 -0.180925
C  -1.706428 2.177737 0.396194
C  -0.142072 -2.754446 0.475801
C  -0.991617 -3.868532 -0.172674
C  1.369005 -3.041889 0.386647
C  -2.508678 -3.585782 -0.141976
C  4.792863 1.882695 -0.66378
C  -4.199148 2.188834 0.446791
C  7.044547 2.614252 -0.098202
C  -5.805051 3.766326 -0.480381
H  2.375837 0.924332 1.713386
H  3.963902 1.745405 2.003618
H  2.792127 0.769421 -2.083977
H  1.711913 0.267712 -0.708361
H  -1.960015 0.284161 -1.491209
H  -3.026964 1.647959 -2.030559
H  -3.075268 0.470048 2.168344
H  -1.974801 -0.419742 1.028641
H  1.500723 2.6056 0.158341
H  2.956135 3.601765 0.463385
H  2.491987 3.192452 -1.215895
H  -0.790831 1.576277 0.238999
H  -1.679165 3.040632 -0.292139
H  -1.699841 2.558857 1.43238
H  -0.437127 -2.646085 1.540856
H  -0.354918 -1.788609 -0.019342
H  -0.669848 -4.022606 -1.223976
H  -0.815229 -4.830425 0.349324
H  1.682231 -3.069909 -0.674158
H  1.597357 -4.03959 0.816788
H  -2.836318 -3.387954 0.896038
H  -3.06277 -4.479147 -0.496198
H  1.997322 -1.882877 2.06949
H  -2.579273 -2.449421 -1.945518
H  7.506397 1.771826 -0.638178
H  6.999135 3.494728 -0.76075
H  7.58732 2.836893 0.830336
H  -6.66328 3.17806 -0.117179
H  -5.563008 4.553629 0.253093
H  -6.00533 4.190355 -1.47362
