program: Gaussian 09
title: 000272281
version: EM64L-G09RevD.01
frameworkgroup: C1[X(C20H16N2O)]
method: RPBEPBE
basis: SDD
operation: Freq
keyword: #p
keyword: freq=noraman
keyword: PBEPBE/SDD
title: #p freq=noraman PBEPBE/SDD
converged: YES YES NO NO
title: Mulliken charges:
elementType: O N N C C C C C C C C C C C C C C C C C C C C H H H H H H H H H H H H H H H H
charge: -0.266667 -0.213963 -0.023189 -0.258244 -0.446341 -0.023022 -0.334252 0.277088 0.048098 0.185437 -0.420812 0.411229 0.431348 -0.479091 -0.395749 -0.363048 -0.377457 -0.429575 -0.240507 -0.241037 -0.224814 -0.197758 -0.264001 0.281599 0.245754 0.230832 0.215632 0.231763 0.259832 0.238470 0.271449 0.233223 0.270508 0.241696 0.228898 0.227281 0.220458 0.222653 0.226279
chargesum: 0.00000
title: Mulliken charges with hydrogens summed into heavy atoms:
elementType: O N N C C C C C C C C C C C C C C C C C C C C
charge: -0.266667 -0.213963 -0.023189 0.023355 0.030245 -0.023022 0.113143 0.277088 0.048098 0.185437 -0.160980 0.411229 0.431348 -0.240621 -0.124300 -0.129826 -0.106949 -0.187879 -0.011609 -0.013756 -0.004356 0.024895 -0.037723
polarizability: 5.53592349e+02 7.72653964e+00 2.32003165e+02 -1.88887030e+00 1.20464795e+00 1.00061829e+02
1716.lowfreq: -5.0456 -0.0009 -0.0004 -0.0003 1.7576 8.6065 28.0181 43.7931 66.9302
frequency: 27.9861 43.7441 66.9273 73.9288 105.4452 133.8676 175.7321 178.6428 194.4091 219.7311 235.7622 264.2593 308.4268 356.8555 366.5472 374.2149 410.9265 420.4804 443.3716 468.1693 490.9001 503.6775 514.8278 533.9264 569.2650 584.2343 591.9958 614.5697 644.5763 661.2730 684.6241 692.6991 702.7623 754.3105 755.4174 762.4833 796.1227 824.2009 824.9542 830.7249 837.1487 878.5241 889.3789 890.2032 937.4957 953.2666 963.6555 964.1450 973.7869 979.6354 980.3325 985.5482 994.9780 1006.9015 1026.5286 1032.0468 1052.8131 1056.6136 1059.4196 1095.3851 1117.0052 1124.0578 1146.5181 1167.8798 1170.8734 1171.7691 1180.9509 1187.6780 1206.4654 1234.1859 1263.3443 1277.7542 1290.7207 1302.4108 1323.3843 1334.1220 1351.5733 1369.4385 1387.6313 1392.2732 1406.2534 1416.0479 1438.8489 1448.5739 1456.9859 1470.1663 1481.3386 1496.5148 1515.8283 1554.8655 1568.8687 1584.5838 1606.6655 1616.1093 1630.1539 2949.4235 2980.8686 2995.1147 3060.1508 3094.7980 3122.4060 3125.1286 3133.3826 3134.1047 3137.0778 3149.7740 3155.8342 3162.8824 3164.3613 3174.3740 3182.9670
redmass: 5.6010 3.9701 5.0132 5.9632 3.6204 3.4859 5.1113 5.1362 2.9239 6.2170 5.0517 4.5849 4.3375 6.1232 4.1632 4.2797 2.9373 3.1393 5.1525 6.6530 5.0512 2.9987 4.5655 4.7765 3.3792 6.7969 6.1693 6.4179 4.2434 5.1956 4.3493 1.9588 4.2938 1.7550 3.8190 1.3604 3.4251 4.6818 1.3680 1.4506 4.8219 4.2015 1.5859 1.5100 3.3756 2.1710 1.3589 1.3580 4.5987 5.5019 1.3856 1.3121 1.3303 4.4433 2.1930 1.9924 3.3391 4.0855 2.3786 1.8644 2.0228 2.3089 1.3969 1.1420 1.1000 1.0947 1.5550 1.1230 1.4054 1.8698 1.6902 1.3616 1.2949 2.6633 1.3366 1.6700 2.0705 1.8501 6.5926 2.9017 5.1186 3.3476 3.8395 2.5327 2.7368 1.1286 1.1410 2.7470 4.2560 8.2261 8.4782 6.6762 6.4105 6.1801 7.0271 1.0689 1.0746 1.0737 1.0959 1.1010 1.0863 1.0846 1.0889 1.0880 1.0899 1.0932 1.0960 1.0971 1.0988 1.0974 1.0956
irintensity: 0.0978 0.5364 0.2811 0.1987 7.4404 2.3963 1.7954 1.1695 5.5598 0.1880 0.9509 1.9046 9.2978 2.4714 1.8783 4.3479 0.0022 4.6387 0.9370 2.0482 0.9441 11.3229 0.9446 0.3829 12.1758 9.4051 5.8738 0.2617 6.5395 15.0438 7.4727 41.3815 6.7843 84.6079 6.8523 34.7796 1.7979 58.7775 5.6518 72.8585 4.7657 15.2101 0.4373 13.7103 8.8288 26.1934 1.1924 2.4558 2.5643 12.1523 1.8614 1.0968 0.0545 3.5383 8.9676 39.7450 79.0282 205.3397 2.4650 73.6865 50.4346 19.3705 3.7982 1.3535 3.1917 0.4565 11.9400 2.3604 45.9201 0.2926 13.5454 8.1594 5.4857 27.4289 12.4285 15.4440 80.5287 15.1790 9.3256 169.1160 14.2088 14.0144 20.3214 10.1928 9.1278 6.0773 65.5981 375.2756 32.8526 15.9399 36.1892 0.8003 2.1668 304.3109 0.9888 40.8183 16.5877 48.0709 22.2352 25.8510 1.5603 11.9797 9.8113 3.3955 19.7334 36.7310 38.8034 11.2301 37.2858 21.2039 3.3211
temp: 298.150 k
press: 1.00000 atm
elementType: 8 7 7 6 6 6 6 6 6 6 6 6 6 6 6 6 6 6 6 6 6 6 6 1 1 1 1 1 1 1 1 1 1 1 1 1 1 1 1
symmnumber: 1
zpe: 808551.6 jmol-1
zpe.correction: 0.307961 hartree
zpe.thermalcorrener: 0.325223 hartree
zpe.thermalcorrenthalpy: 0.326167 hartree
zpe.thermalcorrgfe: 0.262367 hartree
zpe.sumelectzpe: -954.861961 hartree
zpe.sumelectthermal: -954.844699 hartree
zpe.sumelectthermalent: -954.843755 hartree
zpe.sumelectthermalfe: -954.907555 hartree
dipole: -0.1020 -2.4203 -0.1067
dipole: 2.4248
quadrupole: -125.4704 -116.3234 -140.0975
quadrupole: -8.3795 0.3278 0.3706
quadrupole: 1.8267 10.9737 -12.8004 -8.3795 0.3278 0.3706
hfenergy: -955.1699219 hartree
pointgroup: C01 [X(C20H16N2O1)]
dipole: 0.0364601 0.9518175 -0.0531874 debye
polarizability: 553.5109861|9.0452025|232.0232535|3.1071361|-2.7373273|100.1231026 unknown
InChI: InChI=1S/C20H16N2O/c1-2-7-16(8-3-1)22-12-15-13-23-20-17-9-5-4-6-14(17)10-11-18(20)19(15)21-22/h1-11,15H,12-13H2
charge 0 multiplicity 1
39 atoms
O  1.823354 1.986804 -0.093993
N  -2.524904 0.352711 0.176769
N  -1.45808 -0.554615 0.112552
C  -0.555195 1.635588 0.454947
C  -2.069117 1.779833 0.16018
C  -0.331498 0.138635 0.231511
C  0.43763 2.403889 -0.428994
C  1.025389 -0.356469 0.117268
C  2.064497 0.597481 -0.012813
C  3.444161 0.202542 -0.065329
C  1.364659 -1.754248 0.14501
C  -3.851562 -0.071848 -0.000295
C  3.757149 -1.21055 -0.008568
C  2.688196 -2.169533 0.086625
C  4.506506 1.156669 -0.178499
C  -4.899024 0.887408 -0.109313
C  -4.166506 -1.460509 -0.058569
C  5.130647 -1.610661 -0.057887
C  5.837403 0.731158 -0.223942
C  6.153411 -0.662144 -0.161524
C  -6.233955 0.458456 -0.267955
C  -5.504221 -1.867557 -0.218391
C  -6.550685 -0.917567 -0.322747
H  -0.333557 1.882317 1.512157
H  -2.595609 2.367029 0.930766
H  -2.275481 2.235354 -0.831927
H  0.251571 2.196096 -1.502051
H  0.432241 3.490942 -0.251541
H  0.546465 -2.47634 0.22933
H  2.936066 -3.236384 0.117868
H  4.253051 2.219268 -0.226242
H  -4.679794 1.959562 -0.073009
H  -3.356314 -2.189345 0.019576
H  5.369005 -2.68007 -0.01355
H  6.645284 1.466162 -0.308399
H  7.200299 -0.983281 -0.197871
H  -7.029266 1.208273 -0.349944
H  -5.73322 -2.938658 -0.261568
H  -7.588495 -1.244501 -0.444639
