program: Gaussian 09
title: 000026185
version: EM64L-G09RevD.01
frameworkgroup: C1[X(C11H14N2O4)]
method: RPBEPBE
basis: SDD
operation: Freq
keyword: #p
keyword: freq=noraman
keyword: PBEPBE/SDD
title: #p freq=noraman PBEPBE/SDD
converged: YES YES NO NO
title: Mulliken charges:
elementType: O O O O N N C C C C C C C C C C C H H H H H H H H H H H H H H
charge: -0.338122 -0.313291 -0.272631 -0.270435 -0.462663 -0.367596 0.520980 0.419905 -0.551423 -0.482212 -0.359123 -0.341878 -0.173028 0.275921 -0.648000 0.265861 -0.493909 0.320631 0.224924 0.306100 0.220053 0.253768 0.227275 0.332762 0.327119 0.234359 0.207504 0.220184 0.232978 0.242260 0.241728
chargesum: 0.00000
title: Mulliken charges with hydrogens summed into heavy atoms:
elementType: O O O O N N C C C C C C C C C C C
charge: -0.338122 -0.313291 -0.272631 -0.270435 -0.129902 -0.040477 0.520980 0.419905 -0.230793 -0.257288 -0.053023 0.131942 0.054247 0.275921 0.014048 0.265861 0.223057
polarizability: 2.27749913e+02 2.36927382e+00 1.68448915e+02 -3.44451041e+00 5.50564935e+00 7.67860763e+01
1716.lowfreq: -6.7505 -2.2961 -0.0008 -0.0007 -0.0003 0.6990 14.3439 25.0507 39.1541
frequency: 14.0986 25.0103 39.1509 51.4523 64.0039 66.6256 71.6152 104.0305 134.1658 148.6240 205.6662 222.4916 235.0600 255.3742 276.1871 306.8969 333.5403 336.3069 391.0723 414.5012 455.4843 587.6372 595.9463 601.3222 604.0845 641.2531 667.0394 677.5024 682.9820 694.2328 700.6606 747.7141 786.8035 791.8547 877.5029 891.7236 893.5861 913.5951 919.7227 974.9762 979.3016 989.3186 1036.7646 1076.1942 1095.6143 1109.9951 1118.9858 1144.2971 1145.9060 1151.3437 1172.3320 1186.7532 1202.8487 1264.4975 1282.9608 1291.6601 1357.0906 1390.6086 1392.8885 1423.2343 1444.6865 1451.1814 1468.0831 1469.3306 1473.3358 1476.8053 1483.4924 1488.2340 1519.4320 1596.5275 1625.0748 1670.0502 1685.6846 2984.1933 2992.5229 3001.4847 3068.2767 3087.3086 3098.8913 3101.6041 3123.6058 3144.7711 3152.7882 3194.8943 3212.4904 3546.4564 3563.2231
redmass: 3.1651 4.2871 4.6834 2.0048 2.9265 3.6257 2.4761 4.7543 3.0249 3.7740 2.0037 2.9844 4.4596 4.6098 2.9004 5.0948 4.7046 5.0961 5.8314 2.7693 3.0719 1.3553 5.9254 3.2160 5.2771 1.3374 6.5108 5.5066 7.9497 2.3624 5.8907 5.3295 1.4130 1.4787 2.8465 4.7902 1.4008 3.2296 1.4493 1.3886 4.0954 4.5652 4.3374 2.7862 1.6459 2.1527 1.2549 1.8216 1.5841 2.2763 2.5092 1.3383 2.0991 2.4029 1.1672 1.3588 1.2962 1.2218 7.1195 1.2316 2.5754 1.0497 1.0956 1.0749 1.0685 2.3570 1.0820 1.7093 2.3005 5.3451 6.3410 8.3493 9.8422 1.0361 1.0669 1.0298 1.0976 1.0973 1.1016 1.1047 1.0885 1.1043 1.0953 1.0927 1.0948 1.0761 1.0771
irintensity: 1.2557 0.0990 9.5136 0.2348 4.4349 1.1677 0.5060 0.4425 1.4004 6.8962 8.1108 0.2329 0.0002 5.1193 3.6867 9.5140 23.0719 13.7025 0.7688 2.8085 7.0586 120.6887 5.1476 6.6855 1.4750 33.3220 23.6035 1.8464 5.6533 48.5243 49.0141 3.9779 8.0713 90.2989 25.6655 5.7900 0.2818 7.0245 46.1670 14.7151 128.0556 139.3473 85.7614 36.4887 17.6936 46.8106 0.3261 88.0879 250.4574 320.3649 518.1004 238.8320 10.5510 22.5049 43.9056 19.8826 3.5285 19.7425 19.2977 1.4803 196.2078 13.5958 118.1685 11.6449 5.3459 8.1094 12.4165 450.9687 425.1220 87.3906 126.6529 186.7959 314.2139 27.5460 54.4884 48.1777 9.2761 36.0297 36.2414 29.7185 12.5577 18.6715 20.5566 9.9280 7.5111 36.3455 35.0837
temp: 298.150 k
press: 1.00000 atm
elementType: 8 8 8 8 7 7 6 6 6 6 6 6 6 6 6 6 6 1 1 1 1 1 1 1 1 1 1 1 1 1 1
symmnumber: 1
zpe: 636045.6 jmol-1
zpe.correction: 0.242257 hartree
zpe.thermalcorrener: 0.259980 hartree
zpe.thermalcorrenthalpy: 0.260925 hartree
zpe.thermalcorrgfe: 0.192721 hartree
zpe.sumelectzpe: -836.726767 hartree
zpe.sumelectthermal: -836.709044 hartree
zpe.sumelectthermalent: -836.708100 hartree
zpe.sumelectthermalfe: -836.776303 hartree
dipole: -1.2851 -1.5057 -0.1226
dipole: 1.9833
quadrupole: -71.4646 -91.0592 -102.3292
quadrupole: -12.4196 -2.4346 1.1663
quadrupole: 16.8197 -2.7749 -14.0448 -12.4196 -2.4346 1.1663
hfenergy: -836.9690243 hartree
pointgroup: C01 [X(C11H14N2O4)]
dipole: 0.4879563 0.537075 0.2869137 debye
polarizability: 225.1992987|-4.5680492|153.0816013|19.0084844|34.3133615|94.7040039 unknown
InChI: InChI=1S/C11H14N2O4/c1-3-12-10(14)17-9-6-4-5-8(7-9)13-11(15)16-2/h4-7,12-13H,3H2,1-2H3
charge 0 multiplicity 1
31 atoms
O  -1.569314 0.404827 -0.520617
O  4.934038 0.680192 0.747063
O  -3.447657 -0.927972 -1.175828
O  2.81312 1.705076 0.82722
N  3.170522 -0.467329 -0.066226
N  -3.628623 1.303468 -0.459609
C  1.869797 -0.875823 -0.468774
C  -0.5257 -0.537905 -0.733244
C  0.73029 -0.054576 -0.306726
C  1.739546 -2.16493 -1.054053
C  -0.685327 -1.815755 -1.317625
C  -5.09292 1.409155 -0.551108
C  0.471742 -2.614379 -1.467342
C  -2.95086 0.148013 -0.763682
C  -5.755185 1.650413 0.821193
C  3.541282 0.727846 0.52436
C  5.499434 1.889747 1.377718
H  0.813533 0.937796 0.139373
H  2.621502 -2.804181 -1.181379
H  -1.667913 -2.167986 -1.630433
H  -5.357232 2.225732 -1.251196
H  -5.450043 0.463465 -0.992268
H  0.374589 -3.608576 -1.916645
H  3.936442 -1.126037 -0.2220
H  -3.077392 2.093566 -0.120967
H  -5.532149 0.820163 1.51336
H  -5.39991 2.590856 1.282039
H  -6.851891 1.723911 0.706006
H  6.572118 1.67453 1.483658
H  5.032688 2.066267 2.361561
H  5.335376 2.772126 0.73617
