program: Gaussian 09
title: 000272270
version: EM64L-G09RevD.01
frameworkgroup: C1[X(C11H7N3O5S2)]
method: RPBEPBE
basis: SDD
operation: Freq
keyword: #p
keyword: freq=noraman
keyword: PBEPBE/SDD
title: #p freq=noraman PBEPBE/SDD
converged: NO YES NO NO
title: Mulliken charges:
elementType: S S O O O O O N N N C C C C C C C C C C C H H H H H H H
charge: 0.929264 0.380191 -0.227605 -0.483888 -0.508146 -0.169205 -0.236391 -0.138985 -0.357953 -0.002250 -0.418677 -0.060067 0.261518 0.299324 0.242160 -0.251646 -0.214267 -0.202012 -0.223140 -0.423040 -0.208825 0.369162 0.296241 0.333328 0.246007 0.246222 0.282631 0.240050
chargesum: 0.00000
title: Mulliken charges with hydrogens summed into heavy atoms:
elementType: S S O O O O O N N N C C C C C C C C C C C
charge: 0.929264 0.380191 -0.227605 -0.483888 -0.508146 -0.169205 -0.236391 -0.138985 0.011208 -0.002250 -0.418677 -0.060067 0.261518 0.299324 0.242160 0.044595 0.119061 0.043995 0.023082 -0.140410 0.031225
polarizability: 3.59741156e+02 2.04908002e+00 2.06164831e+02 6.27503587e+00 3.46923135e+00 1.00791192e+02
1716.lowfreq: -10.6365 -0.0018 0.0011 0.0016 2.9205 4.8635 22.8270 35.3693 48.1294
frequency: 22.8212 35.3589 48.0899 52.5214 72.2935 97.4603 123.7428 129.0425 148.0358 165.9271 183.2625 238.1729 242.9083 266.5472 292.4352 310.6880 349.1195 362.9868 386.0480 401.5176 405.0219 414.3725 421.8611 465.7275 486.8614 499.7263 550.2690 599.7899 612.6977 619.9521 649.3276 651.5327 670.6524 682.6815 686.3633 701.0535 726.2944 759.9637 789.5454 799.1518 805.0433 848.0766 850.5699 933.6982 943.6034 967.8170 989.8926 1003.6693 1005.5850 1007.3753 1042.1010 1062.8304 1084.3335 1140.2530 1174.6859 1184.3966 1190.8187 1207.6941 1254.6273 1318.0988 1326.4023 1382.5511 1420.9613 1437.7413 1455.2976 1483.5329 1552.4742 1569.0236 1597.5931 1641.2777 1674.9277 3129.6244 3141.9891 3155.7930 3166.8604 3176.7212 3230.5473 3551.9690
redmass: 8.6653 6.7626 5.5108 11.5075 7.8672 12.0165 11.7313 9.9469 10.8871 8.2625 6.0800 13.2918 9.0025 10.5003 9.7079 7.5631 13.5874 14.4506 12.5833 8.8135 3.3625 13.8003 8.3486 6.7617 5.7188 6.4453 11.0997 6.4953 11.8760 1.5275 7.7133 9.2030 10.8109 2.7382 5.9493 3.4849 7.6094 1.3319 1.3435 6.3147 16.3437 10.1974 1.2389 18.8359 1.3587 5.4805 1.4095 4.0639 9.6611 1.4538 1.9960 4.8358 1.6031 11.1756 1.0623 5.1226 1.1623 3.9591 1.6245 1.2792 2.1445 8.1426 9.9135 2.2667 1.9121 3.6455 10.7955 5.5815 6.7656 9.6868 9.7530 1.0926 1.0874 1.0912 1.0959 1.1010 1.0962 1.0781
irintensity: 2.5571 1.0261 0.9733 1.5502 0.4115 0.3111 0.9751 3.5785 2.8385 2.5196 2.4166 16.4150 12.2895 2.3708 11.6441 5.0877 16.8103 4.7674 12.7605 14.7552 1.5536 42.1816 27.7586 7.8249 55.0800 17.7561 2.2761 1.4834 7.1471 59.9802 13.7240 8.0032 1.3983 26.2433 25.0282 52.0751 9.2306 82.7486 38.0486 15.4557 67.7437 78.5174 0.1076 48.6487 4.0735 5.6158 0.6896 7.3943 31.2748 0.8855 23.0704 21.0516 5.8079 130.3146 2.8792 35.7530 27.7204 145.3572 20.0709 4.6516 181.5122 8.0530 93.9420 23.0826 28.3833 122.0441 40.3905 2.6442 6.1465 555.2531 228.8525 54.5451 3.3228 5.5839 4.0744 37.5888 3.5963 116.6889
temp: 298.150 k
press: 1.00000 atm
elementType: 16 16 8 8 8 8 8 7 7 7 6 6 6 6 6 6 6 6 6 6 6 1 1 1 1 1 1 1
symmnumber: 1
zpe: 455970.3 jmol-1
zpe.correction: 0.173670 hartree
zpe.thermalcorrener: 0.192416 hartree
zpe.thermalcorrenthalpy: 0.193361 hartree
zpe.thermalcorrgfe: 0.124867 hartree
zpe.sumelectzpe: -1758.186207 hartree
zpe.sumelectthermal: -1758.167461 hartree
zpe.sumelectthermalent: -1758.166517 hartree
zpe.sumelectthermalfe: -1758.235010 hartree
dipole: 0.1395 4.4465 0.5409
dipole: 4.4814
quadrupole: -79.3893 -141.7908 -142.8639
quadrupole: -0.0572 3.7616 -1.5625
quadrupole: 41.9588 -20.4428 -21.5159 -0.0572 3.7616 -1.5625
hfenergy: -1758.3598774 hartree
pointgroup: C01 [X(C11H7N3O5S2)]
dipole: 0.052917 -1.7013868 0.4594787 debye
polarizability: 359.5299827|-5.4383047|193.746575|-8.2880942|-34.1130864|113.4206212 unknown
InChI: InChI=1S/C6H5O2S.C5H2N3O3S/c7-9(8)6-4-2-1-3-5-6;9-4-2-3(6-1-12-2)7-5(10)8(4)11/h1-5H;1,7H
charge 0 multiplicity 1
28 atoms
S  -1.351367 1.14761 -0.865547
S  4.835311 1.212831 -0.57373
O  -0.230775 1.138554 0.991914
O  -1.634062 2.603041 -1.528407
O  -0.433458 0.048844 -1.65228
O  1.896549 2.607851 0.106477
O  -0.055306 -1.597802 1.173383
N  0.943518 0.51419 0.716352
N  2.182824 -1.51966 0.531132
N  4.500739 -1.421433 -0.175746
C  3.243878 0.592533 -0.015555
C  -3.004757 0.428922 -0.300038
C  3.291694 -0.797279 0.121879
C  2.054171 1.375473 0.237073
C  0.946277 -0.932187 0.823308
C  -4.148743 1.194681 -0.58439
C  -3.009213 -0.808694 0.361538
C  -5.395659 0.654799 -0.194345
C  -4.27192 -1.323255 0.739449
C  5.395658 -0.514956 -0.549276
C  -5.454947 -0.598011 0.461154
H  2.237875 -2.539116 0.594769
H  -4.066258 2.161317 -1.090703
H  -2.076538 -1.33289 0.599158
H  -6.31304 1.214448 -0.403139
H  -4.322665 -2.284669 1.260309
H  6.419486 -0.754773 -0.834481
H  -6.425574 -1.00617 0.762739
