program: Gaussian 09
title: 000272261
version: EM64L-G09RevD.01
frameworkgroup: C1[X(C14H15NO3S)]
method: RPBEPBE
basis: SDD
operation: Freq
keyword: #p
keyword: freq=noraman
keyword: PBEPBE/SDD
title: #p freq=noraman PBEPBE/SDD
converged: YES YES NO NO
title: Mulliken charges:
elementType: S O O O N C C C C C C C C C C C C C C H H H H H H H H H H H H H H H
charge: 0.949241 -0.531576 -0.522020 -0.257997 -0.520288 -0.126409 0.338818 -0.204580 -0.232392 -0.319021 -0.363644 0.446159 -0.361290 -0.380310 -0.328812 -0.327334 0.340389 -0.803874 -0.537912 0.280039 0.282274 0.286910 0.285090 0.224626 0.234986 0.232218 0.253354 0.264940 0.223828 0.227763 0.239745 0.228716 0.252259 0.226106
chargesum: 0.00000
title: Mulliken charges with hydrogens summed into heavy atoms:
elementType: S O O O N C C C C C C C C C C C C C C
charge: 0.949241 -0.531576 -0.522020 -0.257997 -0.240249 -0.126409 0.338818 0.077694 0.054518 -0.033931 -0.139017 0.446159 -0.126304 -0.148092 -0.075459 -0.062394 0.340389 -0.112539 0.169169
polarizability: 2.43090350e+02 1.84567166e+01 2.32079342e+02 1.97354529e+01 6.68156532e+00 1.56959589e+02
1716.lowfreq: -5.4964 -0.0017 -0.0008 0.0012 0.7344 12.2769 16.9101 26.7241 45.0728
frequency: 15.9927 26.6078 45.0498 49.0382 60.4535 80.3282 95.2763 118.0299 137.7459 171.7505 190.0577 209.0122 213.5406 234.9004 245.2473 304.0359 317.8219 342.1801 363.6044 393.8994 403.8475 418.3960 420.9418 436.2867 471.7492 476.8407 519.2228 536.3731 581.8168 616.7842 634.3732 713.1433 714.6246 741.0159 759.5006 794.5227 816.3539 818.7307 821.7483 834.2094 839.3929 846.7368 944.5271 949.5244 955.7034 971.8777 974.4379 980.6600 985.2091 986.9454 1006.7589 1045.5131 1045.6970 1110.2113 1112.2875 1118.4414 1155.3729 1176.6619 1184.9871 1218.7651 1228.0856 1234.9275 1238.2904 1290.1101 1317.0387 1378.5978 1385.4584 1398.0606 1412.5967 1418.2226 1434.8854 1468.1572 1469.8544 1470.5790 1474.0200 1475.9220 1495.2536 1570.8490 1584.7514 1598.2923 1612.2127 2968.4087 2975.0105 3054.5628 3060.4935 3085.3253 3114.0343 3127.4762 3134.1322 3139.2333 3152.8380 3156.1647 3174.7460 3175.0880 3177.7873 3374.0239
redmass: 5.2571 3.7304 3.6978 1.0514 4.4765 5.3633 4.0762 6.4433 4.6515 6.3868 6.7560 4.9525 5.1359 1.3768 4.5973 4.9112 2.9768 5.4237 5.2024 8.7137 2.9097 2.9793 3.1431 5.2751 4.4530 4.9315 2.9210 3.0673 6.4177 7.0813 6.2929 2.9549 3.2818 4.3557 5.7168 2.2730 1.3120 2.3019 1.7542 3.5804 1.5804 1.5254 1.4939 1.3691 4.6339 1.3738 1.4320 7.3953 4.8062 1.4203 2.8363 1.6223 2.3205 1.2965 1.2590 1.3161 1.3209 1.1819 1.1636 1.6337 1.6919 3.7927 4.3282 1.2637 1.2992 4.0237 5.5054 1.2383 4.2808 3.0190 1.1968 1.4943 1.0585 1.0728 1.0893 1.3578 2.5744 5.7571 6.9147 6.5865 6.1351 1.0327 1.0384 1.0953 1.1044 1.0994 1.0873 1.0904 1.1000 1.0966 1.0893 1.0886 1.0956 1.0954 1.0967 1.0754
irintensity: 0.1476 0.3720 0.1451 0.6327 0.2744 4.5793 5.0554 3.3773 4.3062 3.3970 7.2241 6.6731 1.1695 1.1664 1.1781 1.4222 1.4381 4.5073 3.1497 31.3280 8.5230 0.4360 6.4493 98.3893 22.9712 63.9227 52.9259 21.7040 5.1775 0.3386 3.0709 0.5777 0.6422 1.5356 11.7729 35.8536 13.9156 137.3974 63.8769 7.8070 48.3658 29.6016 7.7410 3.0727 43.4864 1.2457 1.8447 31.9947 13.7731 0.4746 1.1901 37.4554 22.9793 15.7949 0.1823 12.5707 6.2928 65.5346 1.3224 0.4738 4.5116 222.3293 7.1212 4.6086 2.8303 0.6349 9.7169 9.9783 6.0638 3.3750 20.4976 116.8060 18.0296 15.8782 13.6746 2.1539 37.5001 0.7383 47.4212 81.3480 14.0846 52.6964 37.8109 18.8026 38.2909 17.9906 11.5953 22.8694 20.8289 17.5989 0.8223 1.4399 4.0437 1.0626 8.9843 16.3579
temp: 298.150 k
press: 1.00000 atm
elementType: 16 8 8 8 7 6 6 6 6 6 6 6 6 6 6 6 6 6 6 1 1 1 1 1 1 1 1 1 1 1 1 1 1 1
symmnumber: 1
zpe: 679360.8 jmol-1
zpe.correction: 0.258755 hartree
zpe.thermalcorrener: 0.278031 hartree
zpe.thermalcorrenthalpy: 0.278975 hartree
zpe.thermalcorrgfe: 0.208665 hartree
zpe.sumelectzpe: -1219.401850 hartree
zpe.sumelectthermal: -1219.382574 hartree
zpe.sumelectthermalent: -1219.381630 hartree
zpe.sumelectthermalfe: -1219.451940 hartree
dipole: -1.5363 8.5811 -1.1952
dipole: 8.7991
quadrupole: -108.8459 -127.9024 -114.7136
quadrupole: -1.3312 -1.6708 10.1149
quadrupole: 8.3080 -10.7484 2.4404 -1.3312 -1.6708 10.1149
hfenergy: -1219.6606051 hartree
pointgroup: C01 [X(C14H15N1O3S1)]
dipole: 0.521078 3.3959394 0.4245957 debye
polarizability: 243.8373825|-17.8637429|231.0045843|20.4421693|-7.2985575|157.2873142 unknown
InChI: InChI=1S/C14H15NO3S/c1-11-3-5-12(6-4-11)15-19(16,17)14-9-7-13(18-2)8-10-14/h3-10,15H,1-2H3
charge 0 multiplicity 1
34 atoms
S  0.046296 -2.44091 -0.289449
O  0.641463 -3.761306 0.449662
O  -0.483681 -2.434376 -1.824607
O  4.217136 1.908514 0.307092
N  -1.525792 -1.977389 0.80529
C  1.326962 -1.068846 -0.137187
C  -2.118912 -0.714815 0.536178
C  1.277979 0.0024 -1.042729
C  2.296014 -1.172289 0.881511
C  -2.826366 -0.539653 -0.687856
C  -2.073904 0.359034 1.469953
C  -3.470795 1.746121 -0.012078
C  -3.475275 0.679709 -0.953797
C  -2.76361 1.559575 1.204307
C  2.239219 1.029982 -0.924744
C  3.252547 -0.149985 0.994066
C  3.221745 0.95365 0.097767
C  -4.226031 3.032983 -0.29054
C  4.259804 3.068102 -0.592293
H  -1.165723 -2.082049 1.772836
H  0.523023 0.020495 -1.835122
H  2.317262 -2.047289 1.539286
H  -2.859976 -1.369114 -1.400222
H  -1.512975 0.242698 2.406328
H  -4.01651 0.802477 -1.89981
H  -2.74247 2.368499 1.944402
H  2.213948 1.867105 -1.627534
H  4.0359 -0.18416 1.756391
H  -3.883985 3.854845 0.362135
H  -4.104911 3.355463 -1.340441
H  -5.31173 2.901907 -0.115207
H  4.431161 2.75468 -1.639684
H  5.109896 3.669568 -0.240353
H  3.327792 3.661073 -0.524351
