program: Gaussian 09
title: 000272245
version: EM64L-G09RevD.01
frameworkgroup: C1[X(C12H18N6)]
method: RPBEPBE
basis: SDD
operation: Freq
keyword: #pfreq=noraman
keyword: PBEPBE/SDD
title: #p freq=noraman PBEPBE/SDD
converged: YES YES NO NO
title: Mulliken charges:
elementType: N N N N N N C C C C C C C C C C C C H H H H H H H H H H H H H H H H H H
charge: -0.115317 -0.115321 -0.373151 -0.373148 -0.087876 -0.087874 -0.365028 -0.372862 -0.365030 -0.372866 -0.405694 -0.405699 0.155190 0.155185 -0.221205 -0.221203 -0.324818 -0.324818 0.211117 0.189508 0.190632 0.235474 0.211115 0.189509 0.190635 0.235478 0.225487 0.225419 0.225488 0.225419 0.321533 0.321532 0.259066 0.259067 0.252528 0.252528
chargesum: 0.00000
title: Mulliken charges with hydrogens summed into heavy atoms:
elementType: N N N N N N C C C C C C C C C C C C
charge: -0.115317 -0.115321 -0.051618 -0.051616 -0.087876 -0.087874 0.035597 0.053245 0.035594 0.053247 0.045212 0.045208 0.155190 0.155185 0.037861 0.037863 -0.072290 -0.072290
polarizability: 1.95864236e+02 -2.69769224e-04 1.38779416e+02 2.30756382e-01 2.32146931e-03 1.49013487e+02
1716.lowfreq: -12.5461 -7.3957 -0.0007 -0.0007 -0.0005 7.5885 29.1939 30.2327 59.6764
frequency: 29.1459 30.2302 59.6684 60.2429 64.1621 91.2591 133.1068 203.5864 218.7458 235.7864 256.1974 277.9021 312.0468 322.2552 347.6156 381.9983 408.2976 480.8983 514.4791 615.8861 625.0179 627.3536 669.2844 673.7226 720.8937 730.4168 736.9137 737.0006 742.1673 742.6783 762.5812 791.6444 847.4370 847.6037 847.9803 903.4852 904.8851 917.4529 954.8171 954.9408 977.6150 1001.5325 1009.9206 1019.7434 1057.8532 1068.1603 1069.5769 1086.6428 1086.9355 1098.2085 1119.7522 1132.0705 1138.4451 1147.0870 1149.3961 1150.9124 1195.2904 1202.4235 1225.9516 1246.5529 1254.6734 1272.5788 1283.4659 1305.6767 1322.0088 1322.1169 1339.8499 1341.1217 1350.8534 1367.4240 1379.6164 1384.1330 1397.0067 1397.0643 1454.6228 1455.3754 1461.0348 1461.8700 1464.9103 1466.1575 1473.3959 1475.8479 1525.8955 1526.4351 2868.3195 2875.2340 2881.6729 2889.1520 2920.4396 2920.8287 2999.0450 2999.2329 3033.1247 3036.3418 3043.0275 3046.9956 3226.9357 3226.9441 3257.0535 3257.0672 3565.5889 3565.6825
redmass: 4.5598 5.0230 5.0386 4.7133 4.1765 3.3737 3.9538 4.2459 3.3564 5.2440 4.2071 2.0820 2.1098 2.6065 2.0979 5.1539 1.9140 2.8114 5.4670 2.3739 3.3668 2.8948 5.2861 4.7137 2.9188 1.6563 1.2678 1.3253 1.2420 1.6635 4.3777 3.2171 1.4130 1.3534 1.4715 5.6926 6.7308 2.1887 3.1029 2.8475 1.9685 2.3868 1.8604 2.4572 1.7184 1.4674 1.5411 2.1171 2.1024 2.1058 2.3640 2.8840 3.2071 1.6947 2.0364 2.1604 1.0659 1.2642 2.2310 1.8638 1.5336 1.3927 1.4415 1.2752 1.7283 1.5797 2.0655 2.5408 1.4937 1.4989 1.6878 1.9705 2.3410 2.3985 1.0977 1.0958 2.3177 3.4753 1.3052 1.0975 1.1317 1.1448 4.8139 4.7880 1.0711 1.0703 1.0696 1.0684 1.0658 1.0654 1.0932 1.0930 1.0919 1.0878 1.0918 1.0885 1.0918 1.0918 1.1084 1.1084 1.0816 1.0816
irintensity: 7.3029 0.0001 7.5516 1.1072 6.2395 1.6177 19.8660 3.7282 2.3926 0.2116 5.5391 0.0303 5.8794 21.1349 4.9131 3.0907 0.0395 0.4729 0.2190 0.3673 0.4721 0.7036 6.0952 0.9682 5.6979 56.0677 27.9462 30.7708 140.5185 108.2960 0.1469 24.3012 10.1040 15.9609 5.5105 0.0502 5.4191 5.0731 2.7945 18.3398 18.5651 52.3934 2.8851 2.6550 0.7253 82.3428 0.2581 23.3247 4.5077 0.2317 0.9626 79.5171 27.6146 1.8808 0.6562 4.8841 1.8959 0.0102 63.4771 12.2831 23.9308 22.4859 8.3090 3.3787 26.7025 40.0181 11.1514 5.6141 24.9504 3.1803 2.6432 1.5058 0.6281 22.6812 2.8499 0.0146 3.0732 0.1026 11.7864 12.1182 28.6111 3.7542 39.6979 17.5932 76.9203 1.4092 1.0277 196.8755 5.7534 148.0841 2.1780 37.8878 29.2334 67.6907 33.0509 14.9146 5.6032 3.0008 7.2597 2.9402 100.0496 19.4296
temp: 298.150 k
press: 1.00000 atm
elementType: 7 7 7 7 7 7 6 6 6 6 6 6 6 6 6 6 6 6 1 1 1 1 1 1 1 1 1 1 1 1 1 1 1 1 1 1
symmnumber: 1
zpe: 789904.2 jmol-1
zpe.correction: 0.300859 hartree
zpe.thermalcorrener: 0.316663 hartree
zpe.thermalcorrenthalpy: 0.317607 hartree
zpe.thermalcorrgfe: 0.255481 hartree
zpe.sumelectzpe: -795.198174 hartree
zpe.sumelectthermal: -795.182370 hartree
zpe.sumelectthermalent: -795.181426 hartree
zpe.sumelectthermalfe: -795.243553 hartree
dipole: -0.0001 2.3479 -0.0001
dipole: 2.3479
quadrupole: -135.1424 -102.4534 -104.8358
quadrupole: -0.0017 -25.1204 0.0000
quadrupole: -20.9985 11.6904 9.3081 -0.0017 -25.1204 0.0000
hfenergy: -795.4990331 hartree
pointgroup: C01 [X(C12H18N6)]
dipole: 0.0003179 -0.923727 -0.0003079 debye
polarizability: 195.8636095|0.0173912|138.7794241|-0.2869827|-0.0055669|149.0141058 unknown
InChI: InChI=1S/C12H18N6/c1-2-14-11(13-1)9-17-5-7-18(8-6-17)10-12-15-3-4-16-12/h1-4,13,15H,5-10H2
charge 0 multiplicity 1
36 atoms
N  1.429678 -0.612935 -0.237961
N  -1.42954 -0.61404 0.237562
N  3.729189 0.563797 0.962595
N  -3.729652 0.562238 -0.96222
N  4.658022 1.044244 -1.039285
N  -4.658884 1.040596 1.039974
C  0.61154 -1.830844 -0.466982
C  0.611854 0.610109 -0.462367
C  -0.610626 -1.831612 0.465613
C  -0.61251 0.609332 0.463011
C  2.693171 -0.601587 -1.0225
C  -2.6931 -0.604125 1.022014
C  3.685062 0.350002 -0.410284
C  -3.685502 0.347382 0.410493
C  4.782371 1.445315 1.228571
C  -4.783287 1.4434 -1.227573
C  5.347879 1.725916 -0.019303
C  -5.349036 1.722707 0.020483
H  1.233147 -2.721571 -0.259044
H  0.256095 -1.894329 -1.525337
H  0.268969 0.671669 -1.524998
H  1.235847 1.498803 -0.258192
H  -1.231671 -2.722566 0.256965
H  -0.255144 -1.895718 1.523919
H  -0.269679 0.670217 1.525698
H  -1.237063 1.497801 0.259572
H  2.551086 -0.318732 -2.090816
H  3.103423 -1.631162 -1.014013
H  -2.551281 -0.322065 2.090576
H  -3.102726 -1.633941 1.01264
H  3.051335 0.157738 1.609354
H  -3.051522 0.157068 -1.609248
H  5.023401 1.788526 2.230665
H  -5.024429 1.787276 -2.229411
H  6.192325 2.372165 -0.246953
H  -6.193844 2.368324 0.248584
