program: Gaussian 09
title: 000272229
version: EM64L-G09RevD.01
frameworkgroup: C1[X(C12H12N4O)]
method: RPBEPBE
basis: SDD
operation: Freq
keyword: #p
keyword: freq=noraman
keyword: PBEPBE/SDD
title: #p freq=noraman PBEPBE/SDD
converged: NO YES NO NO
title: Mulliken charges:
elementType: O N N N N C C C C C C C C C C C C H H H H H H H H H H H H
charge: -0.234997 -0.200904 -0.422128 -0.044968 -0.627232 -0.447672 -0.473779 0.218991 0.012898 0.421336 -0.009501 0.150828 -0.345497 -0.347106 -0.236800 -0.238914 -0.262745 0.235454 0.235685 0.250529 0.250248 0.307774 0.245759 0.229930 0.220945 0.217580 0.225474 0.358164 0.310651
chargesum: 0.00000
title: Mulliken charges with hydrogens summed into heavy atoms:
elementType: O N N N N C C C C C C C C C C C C
charge: -0.234997 -0.200904 -0.114354 -0.044968 0.041584 0.023467 0.026997 0.218991 0.012898 0.421336 -0.009501 0.150828 -0.099738 -0.117177 -0.015855 -0.021334 -0.037271
polarizability: 2.36707889e+02 7.92768880e+00 1.77536595e+02 5.79475473e-02 -7.14929761e-03 7.03802786e+01
1716.lowfreq: -7.4982 -5.1223 -0.8933 -0.0005 0.0001 0.0004 36.2343 60.9088 97.3309
frequency: 36.2173 60.9008 97.3245 103.8483 135.2167 188.2828 202.8797 228.2778 233.8585 241.3557 259.2232 302.1098 342.0037 413.4787 448.7451 495.1528 503.9069 512.1254 514.4980 538.8035 554.1743 591.6008 613.0020 628.0042 680.6789 690.4870 694.4905 750.2698 752.7337 780.0820 808.2628 836.3765 864.7662 931.8992 953.7396 965.8466 970.6916 974.8076 982.9867 998.3022 1030.6874 1034.6623 1085.2062 1112.4164 1140.5065 1145.3771 1171.2893 1172.8415 1182.7832 1195.8669 1248.0656 1281.7712 1325.8194 1334.3087 1352.4230 1379.6681 1385.1630 1404.4328 1450.6590 1467.8622 1485.9895 1490.6243 1507.9655 1568.1661 1578.3168 1595.3402 1623.8511 1638.4531 1676.6485 2894.7784 2920.5956 2948.9612 2987.6802 3120.7162 3128.0639 3144.3352 3152.7127 3167.2302 3546.4463 3553.7897 3704.5023
redmass: 5.3820 4.5138 5.2975 3.7691 4.2013 4.8692 1.9246 1.3724 4.4200 7.5056 4.9213 3.3484 4.1046 2.9455 4.8720 5.9393 2.6465 1.1869 6.1284 2.6497 1.3693 6.3888 6.3712 5.6774 5.4679 2.0581 5.8645 7.2378 1.8486 5.4263 1.2663 5.6875 1.5022 5.8071 1.3572 2.8590 3.0921 1.3001 5.2681 1.5887 2.0168 1.6682 1.7296 5.2763 2.7619 1.0865 1.0974 1.0500 4.1025 1.1286 2.1983 1.6277 1.5934 1.4490 2.5056 3.1967 5.7328 4.5262 2.6042 5.4369 1.1150 1.2228 2.4143 5.6296 6.1364 1.6050 5.2967 2.8000 8.2685 1.0558 1.1034 1.0575 1.1046 1.0844 1.0873 1.0925 1.0943 1.1009 1.0708 1.0526 1.1052
irintensity: 0.0173 4.5947 4.2831 0.0588 6.7231 3.5369 20.4928 36.5163 4.5849 3.1880 3.1534 5.3550 1.6767 0.0029 4.8931 3.7387 25.2620 329.9257 1.8640 26.1620 16.2911 1.5463 0.0938 0.1421 0.7315 26.1666 19.4491 16.0261 87.3995 1.8932 0.0002 0.3470 7.1103 11.5480 0.0007 26.3510 22.4504 0.1835 4.6330 0.6280 13.8258 0.0001 4.3474 22.1174 12.1832 0.2532 0.5553 0.4282 37.1614 8.9868 5.8121 43.2842 67.8731 5.3876 25.5575 131.2915 6.9379 149.0191 0.9874 81.8237 7.2066 175.7961 124.8463 504.7712 41.6080 28.3388 369.0903 219.5939 274.1838 87.4327 36.2381 24.4681 24.3490 13.0274 5.1662 36.2437 33.3360 12.0920 33.8328 104.6591 44.5356
temp: 298.150 k
press: 1.00000 atm
elementType: 8 7 7 7 7 6 6 6 6 6 6 6 6 6 6 6 6 1 1 1 1 1 1 1 1 1 1 1 1
symmnumber: 1
zpe: 593457.7 jmol-1
zpe.correction: 0.226036 hartree
zpe.thermalcorrener: 0.240365 hartree
zpe.thermalcorrenthalpy: 0.241310 hartree
zpe.thermalcorrgfe: 0.184527 hartree
zpe.sumelectzpe: -757.505590 hartree
zpe.sumelectthermal: -757.491261 hartree
zpe.sumelectthermalent: -757.490317 hartree
zpe.sumelectthermalfe: -757.547100 hartree
dipole: -1.3276 -8.8397 -0.0100
dipole: 8.9389
quadrupole: -92.2593 -93.9679 -104.0638
quadrupole: 31.7130 0.1037 0.0246
quadrupole: 4.5044 2.7957 -7.3002 31.7130 0.1037 0.0246
hfenergy: -757.7316264 hartree
pointgroup: C01 [X(C12H12N4O1)]
dipole: 0.4545124 -3.4873162 0.0078496 debye
polarizability: 236.3765804|-9.0739884|177.8676223|-0.1557835|-0.1207849|70.38056 unknown
InChI: InChI=1S/C12H12N4O/c13-12-14-10-7-16(6-9(10)11(17)15-12)8-4-2-1-3-5-8/h1-5,14H,6-7,13H2
charge 0 multiplicity 1
29 atoms
O  2.714648 2.617663 -0.00943
N  -0.853896 -0.070639 0.006565
N  2.52285 -1.504337 -0.002744
N  3.820923 0.532853 -0.006865
N  4.898081 -1.544257 -0.006234
C  -0.058587 -1.312637 0.002366
C  -0.026299 1.163341 -0.001124
C  1.346887 -0.759494 -0.000869
C  1.376635 0.610015 -0.003208
C  -2.248702 -0.068895 0.004007
C  2.647392 1.352191 -0.006585
C  3.739522 -0.789652 -0.004974
C  -2.976816 1.160725 0.00316
C  -2.987118 -1.292478 0.004245
C  -4.385161 1.156236 0.003791
C  -4.396682 -1.277876 0.004881
C  -5.111994 -0.058153 0.005024
H  -0.26622 -1.941463 -0.894212
H  -0.262518 -1.943625 0.898068
H  -0.218098 1.79654 0.889835
H  -0.223237 1.789861 -0.895818
H  2.499703 -2.524749 -0.00151
H  -2.441682 2.115524 0.001707
H  -2.463266 -2.254418 0.003112
H  -4.919673 2.113382 0.003116
H  -4.939533 -2.23053 0.005126
H  -6.206713 -0.053139 0.006242
H  5.77139 -1.022383 -0.008319
H  4.914863 -2.560309 0.003843
