program: Gaussian 09
title: 000272226
version: EM64L-G09RevD.01
frameworkgroup: C1[X(C12H13N5)]
method: RPBEPBE
basis: SDD
operation: Freq
keyword: #pfreq=noraman
keyword: PBEPBE/SDD
title: #p freq=noraman PBEPBE/SDD
converged: YES YES NO NO
title: Mulliken charges:
elementType: N N N N N C C C C C C C C C C C C H H H H H H H H H H H H H
charge: -0.200687 -0.064426 -0.118293 -0.639774 -0.592291 -0.473059 -0.451274 0.086715 -0.010480 0.417606 0.143416 -0.351125 -0.344846 -0.037751 -0.237772 -0.239378 -0.265519 0.225750 0.226144 0.244143 0.244106 0.233308 0.241220 0.323573 0.329624 0.216070 0.217684 0.223451 0.328706 0.325157
chargesum: 0.00000
title: Mulliken charges with hydrogens summed into heavy atoms:
elementType: N N N N N C C C C C C C C C C C C
charge: -0.200687 -0.064426 -0.118293 0.013422 0.061572 -0.021165 0.036975 0.086715 -0.010480 0.417606 0.143416 -0.117817 -0.103626 -0.037751 -0.021701 -0.021694 -0.042069
polarizability: 2.55269875e+02 7.37179146e+00 1.79115806e+02 -1.61351690e-03 1.80894859e-02 7.26312894e+01
1716.lowfreq: -10.9649 -8.6446 -0.5908 -0.0008 -0.0006 -0.0005 38.3153 61.8237 99.0408
frequency: 38.3071 61.8236 99.0355 120.9529 148.4781 205.2722 227.7077 235.7648 238.2152 265.1290 290.0503 322.7766 379.6432 414.4886 439.1342 445.7204 504.2030 507.3412 517.4952 531.8723 537.3959 584.5964 585.6012 600.5277 615.0076 685.3591 690.4481 696.3910 752.1544 775.0536 775.1069 807.2878 830.2686 861.8745 913.0407 952.4199 966.3860 972.2667 981.9153 990.2908 1000.6879 1029.8613 1032.3027 1082.6086 1087.6984 1124.9196 1155.2963 1165.3412 1171.6361 1174.0930 1194.7961 1219.7130 1295.1296 1301.4176 1332.2086 1344.3482 1377.2006 1386.7056 1405.0142 1440.4565 1450.6500 1480.6116 1484.9397 1493.9965 1508.2785 1572.7944 1576.0984 1587.3853 1602.9346 1621.6273 1630.9545 2892.9828 2918.3473 2939.4860 2977.3586 3119.5396 3125.8830 3146.2628 3151.4589 3165.8913 3550.8143 3564.2947 3706.8310 3724.3142
redmass: 5.3288 3.8433 4.7616 4.5609 3.3001 3.2950 3.6043 4.3820 4.7219 4.8101 3.0983 3.2327 1.2239 2.9491 3.8597 1.2040 2.6305 6.1914 1.1362 1.0665 3.9647 3.4688 4.8757 6.1898 6.3726 5.0216 1.8722 7.5360 1.8565 5.9465 7.7678 1.2796 5.6734 1.5167 2.8126 1.3575 4.2485 1.2953 5.5069 3.0388 1.6071 2.0200 1.7037 2.0943 2.3192 2.0955 1.0918 2.7204 1.1491 1.0508 1.1351 3.8766 3.0022 1.5931 1.4858 2.1064 3.3748 5.4318 5.5854 5.5411 2.5826 1.1960 2.4579 1.2418 2.3542 3.6930 5.7888 4.4585 1.6037 2.5451 2.8313 1.0557 1.1043 1.0574 1.1037 1.0842 1.0878 1.0915 1.0947 1.1008 1.0451 1.0440 1.1044 1.1059
irintensity: 0.1616 0.2971 0.3872 0.0314 1.0119 24.7407 0.0557 2.2360 0.0812 0.6978 4.7363 7.3774 174.7125 0.0011 6.0065 292.6671 18.8585 2.8865 76.2420 27.6542 2.6797 25.5705 1.5050 1.3278 0.0623 0.0874 40.3655 0.7611 87.8878 2.7106 20.4551 0.4212 1.4536 7.8764 1.0395 0.0145 0.0544 0.2608 7.2633 17.1639 0.1133 11.6496 0.3253 3.7716 17.6495 0.9373 0.0734 10.2752 5.6093 0.2661 11.8002 0.8384 6.7734 10.0649 0.0898 10.7154 218.4997 17.2663 0.9863 253.8203 2.6567 19.9806 112.6771 73.9434 142.7369 207.5217 0.9729 131.8705 714.6847 503.8908 89.1174 65.5303 42.4535 45.1473 26.8412 12.0150 8.7719 36.6597 37.4300 11.9231 80.5660 119.1467 31.6754 45.5064
temp: 298.150 k
press: 1.00000 atm
elementType: 7 7 7 7 7 6 6 6 6 6 6 6 6 6 6 6 6 1 1 1 1 1 1 1 1 1 1 1 1 1
symmnumber: 1
zpe: 627333.5 jmol-1
zpe.correction: 0.238939 hartree
zpe.thermalcorrener: 0.253239 hartree
zpe.thermalcorrenthalpy: 0.254184 hartree
zpe.thermalcorrgfe: 0.197871 hartree
zpe.sumelectzpe: -737.651546 hartree
zpe.sumelectthermal: -737.637245 hartree
zpe.sumelectthermalent: -737.636301 hartree
zpe.sumelectthermalfe: -737.692614 hartree
dipole: -2.5138 2.2554 -0.0063
dipole: 3.3773
quadrupole: -90.7532 -81.3646 -106.1698
quadrupole: -0.5979 0.0019 -0.0694
quadrupole: 2.0093 11.3980 -13.4073 -0.5979 0.0019 -0.0694
hfenergy: -737.8904843 hartree
pointgroup: C01 [X(C12H13N5)]
dipole: -0.983541 -0.8933174 -0.013238 debye
polarizability: 255.3570722|-6.9073377|179.0014703|0.1949028|1.6831788|72.6584283 unknown
InChI: InChI=1S/C12H13N5/c13-11-9-6-17(8-4-2-1-3-5-8)7-10(9)15-12(14)16-11/h1-5H,6-7,13-14H2
charge 0 multiplicity 1
30 atoms
N  0.844684 0.06316 -0.009499
N  -2.506002 1.515325 0.006468
N  -3.792931 -0.582962 -0.028969
N  -2.772087 -2.686898 -0.060556
N  -4.850317 1.504249 0.000847
C  0.046307 -1.18547 -0.032279
C  0.022938 1.291203 0.00746
C  -1.370239 -0.660421 -0.025845
C  -1.388214 0.745129 -0.003066
C  2.237371 0.074273 -0.007973
C  -2.632876 -1.313994 -0.038482
C  2.984581 -1.145012 -0.027584
C  2.961423 1.307547 0.012865
C  -3.677726 0.782724 -0.007653
C  4.393444 -1.12231 -0.0254
C  4.369991 1.310996 0.014659
C  5.103491 0.10104 -0.004117
H  0.273833 -1.822799 0.853201
H  0.276955 -1.792216 -0.938084
H  0.2115 1.936256 -0.876627
H  0.208539 1.909004 0.911499
H  2.464589 -2.108369 -0.045196
H  2.421892 2.259866 0.027415
H  -1.968053 -3.306959 -0.061077
H  -3.713879 -3.073051 -0.066517
H  4.941504 -2.072006 -0.040747
H  4.899748 2.270901 0.030864
H  6.198276 0.111522 -0.001739
H  -4.800974 2.518901 0.015418
H  -5.738666 1.012072 -0.010385
