program: Gaussian 09
title: 000272219
version: EM64L-G09RevD.01
frameworkgroup: C1[X(C20H14Cl2N2O2)]
method: RPBEPBE
basis: SDD
operation: Freq
keyword: #p
keyword: freq=noraman
keyword: PBEPBE/SDD
title: #p freq=noraman PBEPBE/SDD
converged: YES YES NO NO
title: Mulliken charges:
elementType: Cl Cl O O N N C C C C C C C C C C C C C C C C C C C C H H H H H H H H H H H H H H
charge: -0.074430 -0.074431 -0.260619 -0.260626 -0.465918 -0.465915 0.267920 0.267924 -0.364715 -0.344104 -0.344102 -0.364716 0.131523 0.131532 0.616539 0.616529 -0.368993 -0.368993 -0.323894 -0.323887 -0.219427 -0.219428 -0.221097 -0.221108 -0.240648 -0.240647 0.279237 0.224117 0.224117 0.279236 0.319470 0.319472 0.316570 0.316576 0.256441 0.256441 0.234563 0.234563 0.237465 0.237464
chargesum: 0.00000
title: Mulliken charges with hydrogens summed into heavy atoms:
elementType: Cl Cl O O N N C C C C C C C C C C C C C C C C C C C C
charge: -0.074430 -0.074431 -0.260619 -0.260626 -0.146447 -0.146443 0.267920 0.267924 -0.085479 -0.119987 -0.119985 -0.085480 0.131523 0.131532 0.616539 0.616529 -0.368993 -0.368993 -0.007325 -0.007311 0.037014 0.037013 0.013466 0.013455 -0.003183 -0.003184
polarizability: 5.05780817e+02 -2.15165522e+01 2.59428023e+02 7.07331423e-03 -9.77469398e-03 1.11840769e+02
1716.lowfreq: -0.7291 0.0008 0.0022 0.0022 2.0517 5.7135 11.0562 20.8073 27.3738
frequency: 11.0519 20.8072 27.3729 43.5065 47.3682 58.8098 84.9878 91.4559 101.3007 144.6614 148.1088 162.2546 162.4049 212.9561 226.5524 237.8819 276.4243 296.7205 306.5045 320.6778 364.1430 377.8373 397.4680 409.0914 415.6191 437.1766 440.6900 444.2526 495.6770 504.1219 538.3487 541.6237 581.0531 588.6431 629.4656 661.4633 666.0270 669.2082 677.4236 685.2138 709.3074 714.3488 726.0855 728.8944 762.5809 763.3517 779.4482 822.7503 826.7607 852.5384 861.4377 862.9439 875.0445 875.0544 881.0073 952.3382 952.3695 987.2491 995.7808 998.5091 998.5222 1005.3350 1005.5899 1009.3813 1037.1381 1038.0164 1085.3363 1098.9987 1126.4174 1129.1574 1130.6686 1172.0185 1172.0622 1197.6809 1242.5251 1243.5585 1251.7703 1254.2685 1299.5958 1305.8044 1318.6787 1370.0903 1370.7677 1373.0346 1407.7756 1427.2482 1427.8182 1455.3031 1456.8286 1495.2204 1515.2862 1516.6280 1555.6825 1577.2890 1578.5054 1596.2961 1606.7703 1612.8137 1614.9586 1621.1048 3122.8519 3124.1165 3143.4098 3143.4137 3160.0965 3160.1010 3164.0430 3166.9006 3177.4766 3177.4921 3194.1877 3194.2122 3491.6509 3491.7449
redmass: 11.0517 6.7139 6.4918 7.2032 4.7713 9.3606 8.5714 5.6911 6.2909 6.3887 6.3021 7.7470 5.6688 9.2384 6.4872 7.8805 4.9865 6.1959 8.1011 7.3495 9.2262 7.6027 3.6368 4.4082 9.0778 4.1318 3.4129 4.3079 4.7885 7.7108 3.4220 3.4011 5.8675 6.9464 6.9016 6.6789 6.0731 4.9213 1.5288 1.4314 3.0697 6.5828 3.1624 2.6029 1.2631 1.2716 4.7539 5.1048 5.1302 1.5107 3.9570 2.6729 1.3490 1.3443 3.5602 1.3556 1.3556 1.4114 1.3873 1.3182 1.3183 6.1119 7.0531 3.3966 2.1793 2.0752 4.2030 2.5956 1.4144 1.5764 1.5625 1.0644 1.0644 1.1501 1.7654 1.5560 4.4588 2.3055 1.5871 1.9451 1.4716 6.3932 4.9677 6.9680 3.9930 2.6321 2.6352 2.4046 2.5178 2.5047 2.3119 2.4594 7.1479 5.9283 4.8848 5.3334 7.0221 6.0021 4.9932 6.2925 1.0901 1.0896 1.0867 1.0867 1.0921 1.0921 1.0940 1.0952 1.0983 1.0983 1.0954 1.0954 1.0757 1.0757
irintensity: 0.2946 0.3400 0.2634 0.0829 0.0577 0.0754 12.6807 0.8011 1.4237 6.2651 0.0312 9.6466 0.0014 0.2525 3.1923 3.8498 5.5841 1.1591 0.6428 10.3066 0.3613 12.1936 0.1898 0.0013 3.6529 4.9397 2.8267 15.8342 0.7697 25.6180 2.0714 10.8415 4.1961 20.6353 0.4220 5.0185 32.9242 4.9005 20.4084 11.5516 68.3785 0.4815 1.1202 22.4328 24.8522 226.2704 2.2471 12.6552 1.7932 2.4537 59.6911 23.3600 7.2607 0.8583 12.2854 1.0375 10.6068 3.0861 1.6057 0.8521 7.0141 81.6574 6.1612 15.7599 0.1169 14.1763 0.7248 50.1472 38.6561 0.0348 2.4484 0.0012 1.2320 1.3877 28.1939 1.8488 0.2140 258.0135 0.8192 174.7293 0.2308 357.9275 15.6863 13.0891 1.9891 186.3915 19.0309 23.2448 3.1996 247.4978 999.7054 24.7604 6.5956 75.1200 0.5082 177.9655 15.4413 152.1194 1.4053 0.6913 33.0312 0.0364 6.0490 1.2924 22.6685 1.7388 4.1226 0.0204 20.9730 0.0851 27.2222 0.9126 67.4575 11.2982
temp: 298.150 k
press: 1.00000 atm
elementType: 17 17 8 8 7 7 6 6 6 6 6 6 6 6 6 6 6 6 6 6 6 6 6 6 6 6 1 1 1 1 1 1 1 1 1 1 1 1 1 1
symmnumber: 1
zpe: 765895.9 jmol-1
zpe.correction: 0.291714 hartree
zpe.thermalcorrener: 0.314096 hartree
zpe.thermalcorrenthalpy: 0.315040 hartree
zpe.thermalcorrgfe: 0.236096 hartree
zpe.sumelectzpe: -1948.851870 hartree
zpe.sumelectthermal: -1948.829488 hartree
zpe.sumelectthermalent: -1948.828544 hartree
zpe.sumelectthermalfe: -1948.907488 hartree
dipole: -0.0003 0.0000 1.0546
dipole: 1.0546
quadrupole: -119.1815 -167.3413 -172.3947
quadrupole: 3.1379 0.0004 -0.0002
quadrupole: 33.7910 -14.3688 -19.4222 3.1379 0.0004 -0.0002
hfenergy: -1949.1435841 hartree
pointgroup: C01 [X(C20H14Cl2N2O2)]
dipole: -0.0000989 -0.0000191 0.4149212 debye
polarizability: 507.3208597|-9.0109033|257.8879798|0.0075568|-0.0094059|111.8407687 unknown
InChI: InChI=1S/C20H14Cl2N2O2/c21-15-5-1-3-7-17(15)23-19(25)13-9-11-14(12-10-13)20(26)24-18-8-4-2-6-16(18)22/h1-12,23-24H
charge 0 multiplicity 1
40 atoms
Cl -5.093134 -2.584431 1.050084
Cl 5.093237 2.584618 1.049937
O  -3.089978 2.052073 -0.695051
O  3.089986 -2.052052 -0.694682
N  -3.752301 -0.071591 0.061547
N  3.75228 0.071689 0.061686
C  -1.37449 0.375112 -0.336739
C  1.374475 -0.37505 -0.336636
C  -0.357097 1.362665 -0.355217
C  1.001042 0.996042 -0.352262
C  -1.001058 -0.995982 -0.352185
C  0.357082 -1.362604 -0.35504
C  -2.801576 0.865202 -0.348155
C  2.801561 -0.865145 -0.34793
C  -5.159068 0.069294 0.103057
C  5.159037 -0.069239 0.103247
C  -5.94518 -1.030825 0.547715
C  5.945199 1.030897 0.54778
C  -5.849152 1.254963 -0.278057
C  5.849062 -1.254993 -0.277705
C  -7.344628 -0.986205 0.61845
C  7.344644 0.986208 0.618547
C  -7.256414 1.309242 -0.211674
C  7.256319 -1.309341 -0.211288
C  -8.011126 0.200407 0.233169
C  8.011083 -0.200491 0.233428
H  -0.66144 2.413481 -0.387932
H  1.754279 1.791517 -0.401821
H  -1.754294 -1.79146 -0.401679
H  0.661426 -2.413424 -0.387614
H  -3.407579 -0.974206 0.402246
H  3.407567 0.974353 0.402264
H  -5.259248 2.108562 -0.616035
H  5.259115 -2.1086 -0.615589
H  -7.902153 -1.860361 0.966272
H  7.902211 1.860377 0.966267
H  -7.765203 2.231566 -0.510774
H  7.765062 -2.231731 -0.510262
H  -9.103278 0.248937 0.283372
H  9.103232 -0.249074 0.283658
