program: Gaussian 09
title: 000272199
version: EM64L-G09RevD.01
frameworkgroup: C1[X(C12H8N4O2)]
method: RPBEPBE
basis: SDD
operation: Freq
keyword: #p
keyword: freq=noraman
keyword: PBEPBE/SDD
title: #p freq=noraman PBEPBE/SDD
converged: NO NO NO NO
title: Mulliken charges:
elementType: O O N N N N C C C C C C C C C C C C H H H H H H H H
charge: -0.162536 -0.217770 -0.226645 -0.064316 -0.077963 0.031423 0.230968 0.002771 0.173549 0.306809 -0.200303 -0.266638 -0.195584 -0.352194 -0.373665 -0.230398 -0.227384 -0.229405 0.288009 0.299516 0.248651 0.261384 0.284737 0.230788 0.233645 0.232553
chargesum: 0.00000
title: Mulliken charges with hydrogens summed into heavy atoms:
elementType: O O N N N N C C C C C C C C C C C C
charge: -0.162536 -0.217770 -0.226645 -0.064316 -0.077963 0.031423 0.230968 0.002771 0.173549 0.306809 0.087706 0.032878 0.053067 -0.090810 -0.088928 0.000389 0.006261 0.003147
polarizability: 3.23979304e+02 1.47356324e+01 1.84699805e+02 -6.77063844e-04 1.17569832e-02 6.15661963e+01
1716.lowfreq: -3.6163 -0.0008 0.0002 0.0006 7.8704 12.9513 34.1240 45.3338 69.1497
frequency: 34.0754 45.3161 69.1216 81.5422 131.2141 180.1937 184.0600 260.3997 280.9353 324.4375 334.9654 362.5357 404.3984 462.3451 464.4519 503.4773 543.1682 562.0188 606.3681 614.0014 648.1091 687.8915 691.4819 699.2834 706.9657 736.0593 748.4404 791.2034 797.9406 855.7279 864.8870 911.9188 926.8280 947.8970 951.5714 972.3766 989.4281 995.8147 1010.0839 1022.1459 1055.3868 1079.0895 1083.5375 1127.2844 1159.3080 1174.5090 1186.4573 1187.3470 1201.0095 1237.3956 1292.9736 1324.5886 1345.7489 1371.4386 1389.8342 1416.2934 1445.3090 1447.4982 1500.9926 1516.1427 1544.7624 1587.7790 1618.5093 1629.3415 3130.2073 3141.4729 3153.9927 3163.4066 3172.4476 3179.9927 3192.9754 3211.4091
redmass: 14.5238 4.1441 5.7555 6.6638 8.2652 7.7364 5.1942 5.0818 7.5848 5.8214 6.4296 10.0582 2.8439 9.7345 4.6764 4.4402 8.4074 3.5403 8.1759 6.4536 5.9151 9.3017 7.7418 2.4861 2.6940 3.2922 10.4582 1.8798 1.8694 6.6828 1.2463 10.5507 1.3524 9.0490 1.4252 1.3420 6.2389 1.3763 1.3328 2.5334 2.3249 1.8296 2.3957 2.2537 4.4373 1.0562 1.1493 1.9782 4.8192 5.3969 2.6006 1.4229 2.5212 11.9957 9.4597 2.8270 2.3954 3.1472 3.9992 5.9931 6.3092 6.2622 6.3219 8.2472 1.0853 1.0888 1.0932 1.0965 1.1009 1.0892 1.0923 1.1005
irintensity: 0.0066 0.4388 4.1283 1.6087 0.2211 0.8305 0.0596 0.0761 0.7519 1.2222 2.0189 0.4923 0.0000 1.8754 0.5735 7.2450 0.4331 4.5446 2.4531 0.0169 0.0677 12.5541 7.8860 31.0569 23.3156 71.0488 24.8011 0.8767 67.5935 10.0104 0.0352 10.2463 0.1542 12.1732 5.6092 3.1029 1.0739 0.0051 0.6708 13.8724 1.8229 22.5248 18.2266 51.6883 138.6119 0.2133 45.2610 21.3293 295.0130 10.7455 44.4741 4.2312 3.6191 69.0057 4.9175 215.2165 17.8567 116.2361 48.2472 91.7446 11.2822 0.6419 66.7710 15.8575 0.2726 10.3300 17.8362 13.1059 27.7704 4.7524 5.3280 0.1665
temp: 298.150 k
press: 1.00000 atm
elementType: 8 8 7 7 7 7 6 6 6 6 6 6 6 6 6 6 6 6 1 1 1 1 1 1 1 1
symmnumber: 1
zpe: 482534.8 jmol-1
zpe.correction: 0.183788 hartree
zpe.thermalcorrener: 0.197251 hartree
zpe.thermalcorrenthalpy: 0.198195 hartree
zpe.thermalcorrgfe: 0.142000 hartree
zpe.sumelectzpe: -830.194184 hartree
zpe.sumelectthermal: -830.180720 hartree
zpe.sumelectthermalent: -830.179776 hartree
zpe.sumelectthermalfe: -830.235972 hartree
dipole: -0.8278 5.6804 0.0009
dipole: 5.7404
quadrupole: -89.3747 -100.3332 -105.6983
quadrupole: 20.7845 0.0040 -0.0014
quadrupole: 9.0940 -1.8645 -7.2296 20.7845 0.0040 -0.0014
hfenergy: -830.3779715 hartree
pointgroup: C01 [X(C12H8N4O2)]
dipole: -0.2860758 -2.2402575 -0.0003585 debye
dipolederiv: -0.4014385 0.0961282 -0.0000547 -0.0608286 -0.6755971 -0.0000248 0.0000183 -0.0001607 -0.1889652 -1.0055746 -0.2297614 0.0000386 -0.3135262 -0.5450574 -0.0000527 -0.0002545 -0.0001255 -0.2363424 -0.1070352 0.0066434 0.0000162 0.9191275 -0.2626047 -0.0000202 -0.0000422 -0.0000023 0.0734573 -1.3681854 -0.0865256 -0.0000232 -0.0511171 -0.2739362 -0.0000049 0.0000819 0.0000227 -0.2049603 -0.5633586 0.17026 0.0000272 0.2790291 -0.3976083 0.0000101 0.0001409 -0.0000699 -0.1783271 1.3235796 0.256872 0.0000403 0.8091147 1.5590735 0.0002115 0.0002467 0.0002584 0.1884745 0.6274577 -0.0314977 0.0000476 -0.8343438 0.1408772 -0.0000423 -0.0000043 0.0000118 0.1146777 1.7351869 -0.1330755 -0.0000504 -0.0948916 0.5097244 0.0000355 -0.0000619 0.0000177 0.0693228 0.0278364 0.0575473 -0.0000223 -0.564152 -0.6335823 -0.0001098 -0.0000613 -0.0000411 0.0332825 -0.5012639 0.0586872 0.000004 0.0750482 -0.0048826 0.0000002 -0.0000902 0.0000168 0.005891 0.7155522 0.1950171 0.0000101 -0.2602455 0.1105129 0.0000077 -0.0000204 0.000032 -0.045831 -0.2564191 -0.112447 -0.0000241 0.5075429 0.3477838 0.0000127 0.0000843 0.00006 -0.0604025 -0.4661461 -0.292303 -0.0000219 -0.4443649 -0.218445 -0.0000107 -0.0000187 -0.000015 -0.1851891 0.1396391 -0.0972598 -0.0000021 0.1739988 0.0091228 0.0000116 -0.000005 0.0000112 -0.1333617 0.0511781 0.0830411 0.000007 -0.2108458 -0.0236374 0.0000024 -0.0000133 0.0000097 -0.1183292 -0.0992074 0.1651475 0.0000111 0.3299996 -0.0086091 0.0000106 0.0000327 0.0000087 -0.1526623 -0.2179687 -0.1066043 -0.0000047 -0.2071749 0.1443776 0.0000192 -0.0000085 0.0000174 -0.1526135 0.0678749 -0.0160099 0.0000004 -0.0537002 0.0154022 0.0000091 -0.000004 0.0000101 -0.1452687 0.0921336 -0.0346789 -0.0000037 -0.0076522 0.0578239 -0.0000057 0.0000126 -0.0000022 0.1860783 0.0884458 -0.0108525 0.0000026 -0.0284536 0.1413831 0.0000018 -0.0000228 0.000012 0.1735292 0.0328852 0.0721326 0.0000061 0.0557542 0.0148803 -0.0000099 0.0000002 -0.0000204 0.1722834 0.1252109 0.0594772 0.000004 0.0445535 -0.0276506 -0.0000103 -0.0000018 -0.000011 0.1542929 0.0991916 -0.0790707 -0.0000075 -0.0822496 0.0555862 -0.0000079 -0.0000092 -0.0000058 0.155293 -0.0452442 -0.0909008 -0.0000058 -0.1268745 -0.0230306 -0.0000126 -0.0000068 -0.0000128 0.1580813 0.0415235 0.052791 0.0000034 0.097449 -0.0956865 -0.0000162 0.0000081 -0.0000181 0.1583387 -0.1358539 0.0472423 0.0000017 0.0488029 0.0837798 -0.0000045 -0.0000008 -0.0000038 0.1592502 unknown
polarizability: 324.45714|-12.2620474|184.2219693|0.0004689|0.0117671|61.5661963 unknown
InChI: InChI=1S/C12H8N4O2/c17-16(18)10-7-4-8-15-12(10)13-11(14-15)9-5-2-1-3-6-9/h1-8H
charge 0 multiplicity 1
26 atoms
O  2.203316 2.660198 0.000377
O  4.38023 1.965566 0.000293
N  0.995966 -1.441261 -0.000241
N  0.104008 0.642289 -0.000201
N  -0.377511 -1.653364 -0.000325
N  3.102233 1.740661 -0.00003
C  1.279088 -0.024568 -0.000201
C  -0.865771 -0.362494 -0.000125
C  2.665493 0.323481 -0.000162
C  -2.301117 -0.066506 -0.000109
C  1.94859 -2.426968 -0.000283
C  3.650447 -0.67275 -0.000249
C  3.291614 -2.050847 -0.000274
C  -3.262333 -1.113627 -0.000186
C  -2.730339 1.287948 -0.000028
C  -4.636669 -0.805127 -0.000171
C  -4.107112 1.588313 -0.000017
C  -5.063488 0.545172 -0.000087
H  1.587599 -3.456568 -0.00035
H  4.697058 -0.357681 -0.000236
H  4.061469 -2.824644 -0.000317
H  -2.920722 -2.153859 -0.000252
H  -1.972934 2.078115 0.000029
H  -5.376098 -1.613296 -0.000227
H  -4.435581 2.633172 0.00005
H  -6.133337 0.781645 -0.000078
