program: Gaussian 09
title: 000272198
version: EM64L-G09RevD.01
frameworkgroup: C1[X(C7H6N4O2)]
method: RPBEPBE
basis: SDD
operation: Freq
keyword: #pfreq=noraman
keyword: PBEPBE/SDD
title: #p freq=noraman PBEPBE/SDD
converged: NO YES NO NO
title: Mulliken charges:
elementType: O O N N N N C C C C C C C H H H H H H
charge: -0.149637 -0.217019 -0.268396 -0.051483 -0.125126 0.028741 0.110364 0.266649 0.246976 -0.176304 -0.271303 -0.198105 -0.771181 0.265517 0.302319 0.247876 0.283400 0.238338 0.238374
chargesum: 0.00000
title: Mulliken charges with hydrogens summed into heavy atoms:
elementType: O O N N N N C C C C C C C
charge: -0.149637 -0.217019 -0.268396 -0.051483 -0.125126 0.028741 0.110364 0.266649 0.246976 0.089212 0.031016 0.049771 -0.011069
polarizability: 1.61424596e+02 -4.53972657e+00 1.33181117e+02 -3.30755724e-03 -1.95133366e-04 4.77158179e+01
1716.lowfreq: -7.8118 -4.8937 0.0011 0.0011 0.0014 1.3915 31.1026 87.5265 129.5229
frequency: 30.7460 87.5239 129.4859 171.6045 176.5525 231.4231 246.0255 302.8869 362.4714 395.8717 470.1909 495.0717 563.5608 591.9518 617.2183 641.5607 690.4605 704.0579 729.6295 730.4255 793.0564 849.2347 920.7604 921.0815 956.8503 969.3659 987.9856 1048.0377 1056.9623 1090.2808 1155.2325 1170.1303 1201.7368 1261.4288 1291.9681 1337.8162 1374.3621 1400.2535 1429.2202 1458.8434 1467.1208 1478.6329 1500.4766 1525.3548 1619.6095 2981.6800 3056.9255 3123.2249 3174.7879 3183.2464 3201.3797
redmass: 13.1913 5.1483 1.0557 6.8480 3.7619 5.8225 3.6172 4.2657 8.9257 10.6294 5.6984 4.9578 3.4419 7.4521 5.4997 7.4655 8.7835 6.0001 3.1423 10.1603 1.7311 6.6857 8.6909 1.3437 3.1476 1.3528 3.2834 1.4636 2.1700 4.0129 1.5368 4.2234 4.5601 2.6545 3.6382 2.6301 13.1759 1.2040 2.6202 1.6327 1.0433 2.6524 4.5433 7.3726 6.8477 1.0393 1.0985 1.0960 1.0880 1.0925 1.1007
irintensity: 1.3946 1.3482 0.0029 0.0095 0.0565 1.1681 1.9457 0.2431 1.2324 0.3608 5.3610 2.3800 1.9906 6.4109 1.6456 1.6598 4.1443 0.5318 37.3826 28.0073 40.5405 1.1447 29.0283 2.5630 0.1907 2.4557 15.5008 2.9552 4.9203 13.9341 6.9166 97.4701 231.2764 5.0757 6.6663 34.8369 142.5887 13.9200 0.5787 6.7703 21.2282 12.7002 7.9994 35.9141 18.1817 20.2443 14.7548 1.5761 1.1585 4.4641 3.4692
temp: 298.150 k
press: 1.00000 atm
elementType: 8 8 7 7 7 7 6 6 6 6 6 6 6 1 1 1 1 1 1
symmnumber: 1
zpe: 343063.7 jmol-1
zpe.correction: 0.130666 hartree
zpe.thermalcorrener: 0.141237 hartree
zpe.thermalcorrenthalpy: 0.142181 hartree
zpe.thermalcorrgfe: 0.093433 hartree
zpe.sumelectzpe: -638.751713 hartree
zpe.sumelectthermal: -638.741142 hartree
zpe.sumelectthermalent: -638.740198 hartree
zpe.sumelectthermalfe: -638.788946 hartree
dipole: 5.4827 8.0569 0.0002
dipole: 9.7455
quadrupole: -75.8673 -78.8940 -74.0926
quadrupole: 2.1031 0.0057 -0.0016
quadrupole: 0.4174 -2.6094 2.1920 2.1031 0.0057 -0.0016
hfenergy: -638.8823791 hartree
pointgroup: C01 [X(C7H6N4O2)]
dipole: -2.052978 -3.2382156 0.0000825 debye
dipolederiv: -0.4621101 -0.1053579 -0.0000557 -0.0972847 -0.6700859 0.0000907 -0.0000713 -0.0000706 -0.1814975 -0.9872499 0.0818539 -0.0000791 0.1185137 -0.4535482 0.0000159 -0.0001572 0.0000643 -0.2351805 -0.2122435 -0.3671281 -0.0000277 0.3816787 -0.5486806 0.0000956 0.0001238 -0.0000174 0.0488329 -0.4481116 -0.0623067 0.0001565 0.4494079 -0.1855444 0.0001935 -0.0003588 -0.0000078 -0.2002595 0.0425536 0.2426866 0.0001625 0.0195647 -0.0118933 -0.0002229 0.0005633 -0.0001935 -0.2445438 1.7019595 0.2422327 0.0002277 0.3376105 1.1212458 -0.0000762 0.000222 0.000051 0.1857386 -0.129038 0.2048135 -0.0001155 -0.4562324 0.3265923 0.000084 -0.0000219 0.000031 0.1122768 0.6219462 0.0107082 -0.0002454 -0.0924687 0.0007824 -0.0001579 -0.0000943 0.0001547 0.0478082 -0.3276489 -0.2661612 -0.0000504 -0.5045895 -0.2236878 -0.0000697 -0.0001401 0.0000346 0.0636026 0.2905298 0.0100266 0.0000189 -0.4448742 0.1978492 -0.0000709 -0.0000311 0.0000041 -0.0477146 0.1112723 0.1095411 0.0000177 0.3633592 0.0787693 0.0000448 0.0000204 -0.000084 -0.0688557 -0.4384644 -0.104826 -0.0000533 0.0557358 0.0916219 0.0000109 0.0001505 -0.0000382 -0.1789966 -0.0823225 0.0066024 0.0000222 -0.06286 0.015921 0.0000957 -0.0000288 0.0000903 0.1032433 0.01938 -0.0616751 0.0000008 -0.0167584 0.0727212 0.0000034 -0.00011 0.0000502 0.1810374 0.0836854 0.0357425 0.0000052 0.0218291 0.1368023 0.0000069 0.0000181 -0.0000092 0.1723798 0.0897833 -0.0012974 -0.0000118 -0.0125373 -0.0428675 -0.0000035 -0.0000104 -0.0000016 0.1685132 0.0674079 0.0309386 0.0000005 0.1216617 0.0115239 0.0000362 -0.0000487 0.0000325 0.1357227 0.0292972 -0.003185 0.0079074 -0.0909304 0.0411504 -0.1050718 -0.0529058 -0.0931323 -0.0310032 0.0293737 -0.0032087 -0.0078803 -0.0908256 0.0413282 0.1049954 0.0528802 0.093042 -0.031104 unknown
polarizability: 161.6894803|-3.6135447|132.9162328|0.0032995|0.0003024|47.7158179 unknown
InChI: InChI=1S/C7H6N4O2/c1-5-8-9-7-6(11(12)13)3-2-4-10(5)7/h2-4H,1H3
charge 0 multiplicity 1
19 atoms
O  2.397763 1.833774 0.00017
O  3.584142 -0.120119 0.00049
N  -1.21784 -0.437457 -0.000071
N  -0.476204 1.726664 0.000315
N  -1.895474 1.703489 -0.000615
N  2.473906 0.55146 0.0001
C  -0.064349 0.429336 -0.000047
C  -2.326329 0.42039 0.000126
C  1.213051 -0.227194 -0.000054
C  -1.136041 -1.820622 -0.000131
C  1.298676 -1.61903 -0.000079
C  0.11298 -2.42183 -0.000129
C  -3.749183 -0.030298 0.000435
H  -2.075813 -2.377238 -0.000116
H  2.292918 -2.073344 0.000009
H  0.183509 -3.511475 -0.000093
H  -4.391661 0.863046 0.000162
H  -3.99428 -0.632438 -0.894707
H  -3.99417 -0.631814 0.896035
