program: Gaussian 09
title: 000272196
version: EM64L-G09RevD.01
frameworkgroup: C1[X(C12H8N4O2)]
method: RPBEPBE
basis: SDD
operation: Freq
keyword: #p
keyword: freq=noraman
keyword: PBEPBE/SDD
title: #p freq=noraman PBEPBE/SDD
converged: NO YES YES YES
title: Mulliken charges:
elementType: O O N N N N C C C C C C C C C C C C H H H H H H H H
charge: -0.202616 -0.207082 -0.225024 -0.071425 -0.103959 0.039150 0.278652 -0.010921 0.311323 -0.300132 -0.304171 0.315022 -0.249797 -0.349650 -0.376184 -0.228787 -0.226831 -0.228805 0.332196 0.271266 0.298742 0.265161 0.274949 0.232688 0.232672 0.233565
chargesum: 0.00000
title: Mulliken charges with hydrogens summed into heavy atoms:
elementType: O O N N N N C C C C C C C C C C C C
charge: -0.202616 -0.207082 -0.225024 -0.071425 -0.103959 0.039150 0.278652 -0.010921 0.311323 0.032063 -0.032906 0.315022 0.048945 -0.084488 -0.101235 0.003901 0.005840 0.004760
polarizability: 3.74560310e+02 -4.39073577e+00 1.65235374e+02 2.28407692e-02 1.76785986e-02 6.14927247e+01
1716.lowfreq: -0.0007 -0.0005 -0.0002 1.0041 3.1867 3.2494 42.5068 49.8219 74.5257
frequency: 42.5041 49.7632 74.5214 81.9196 122.8737 190.3780 202.0337 253.0232 279.2848 332.8015 337.4658 386.6089 403.3781 428.8666 487.9263 497.9198 549.1392 558.2725 596.7387 614.2727 669.5955 688.2185 690.3896 698.7235 707.1891 746.9197 759.4681 793.7657 817.3905 828.5729 863.0732 906.5629 909.0625 933.1434 950.2724 981.5030 989.3822 994.4042 1007.7964 1020.2362 1034.2971 1078.6495 1096.0807 1120.1842 1158.1670 1174.4149 1185.6569 1216.5036 1226.6226 1235.8202 1281.7033 1323.4388 1356.5767 1369.9061 1388.8346 1408.8748 1443.9864 1445.7258 1504.5695 1525.6872 1542.9271 1586.6840 1616.8643 1631.9740 3131.3054 3142.5650 3155.3110 3165.1278 3173.6021 3187.5070 3203.7724 3218.9547
redmass: 5.2573 6.9720 7.9657 6.3418 7.4296 8.0077 5.5403 8.2909 6.5349 6.2389 5.7542 9.3897 2.8332 3.1034 9.5707 3.8170 7.0739 5.0561 7.0917 6.5175 7.4487 7.0607 6.4888 2.3750 2.7726 4.7894 9.6111 2.2266 5.4383 1.5093 1.2468 1.4370 8.0826 6.9827 1.4291 1.2976 6.2237 1.3836 1.3319 2.6181 2.7570 1.6353 2.5478 1.7471 7.4792 1.0569 1.1240 6.1112 3.2342 2.9046 1.8932 1.3980 3.6901 5.1998 8.8963 3.7007 2.3871 4.1198 4.1223 7.5809 6.4635 6.2385 6.2188 7.9991 1.0854 1.0888 1.0933 1.0963 1.1008 1.0892 1.0981 1.0952
irintensity: 0.1300 0.0682 0.5676 0.3058 5.8865 3.7109 1.3867 0.5560 0.7490 1.8908 1.3202 0.6700 0.0018 5.0565 3.5830 7.2903 0.2732 1.6683 0.3830 0.0857 26.5011 1.0323 33.7961 32.7985 32.4519 12.5247 12.9682 33.5954 3.8126 37.0430 0.0620 26.7393 12.8471 2.4853 5.7095 0.7700 1.2787 0.0036 0.4887 22.9792 0.4210 13.0417 14.4368 89.2293 1.9944 0.1047 42.1923 729.8425 77.7150 8.9753 20.0357 9.2165 83.4454 40.5143 0.9452 159.4633 21.9612 119.0564 38.3434 31.3882 40.8809 1.7032 104.7308 76.4061 0.1658 10.5551 19.5318 12.3641 27.2740 3.8680 2.0745 16.1985
temp: 298.150 k
press: 1.00000 atm
elementType: 8 8 7 7 7 7 6 6 6 6 6 6 6 6 6 6 6 6 1 1 1 1 1 1 1 1
symmnumber: 1
zpe: 483157.7 jmol-1
zpe.correction: 0.184025 hartree
zpe.thermalcorrener: 0.197403 hartree
zpe.thermalcorrenthalpy: 0.198347 hartree
zpe.thermalcorrgfe: 0.142640 hartree
zpe.sumelectzpe: -830.202604 hartree
zpe.sumelectthermal: -830.189226 hartree
zpe.sumelectthermalent: -830.188282 hartree
zpe.sumelectthermalfe: -830.243988 hartree
dipole: 3.6637 1.5454 0.0006
dipole: 3.9763
quadrupole: -113.1028 -97.7229 -105.6480
quadrupole: -11.2934 -0.0007 0.0008
quadrupole: -7.6116 7.7684 -0.1568 -11.2934 -0.0007 0.0008
hfenergy: -830.3866287 hartree
pointgroup: C01 [X(C12H8N4O2)]
dipole: -1.4398667 0.6116789 -0.0002422 debye
dipolederiv: -1.1348085 -0.1396168 -0.0000402 -0.2445121 -0.5063588 0.0000183 0.000021 0.0000528 -0.225461 -0.6398016 0.115108 -0.0000371 0.5238496 -0.8071168 0.0001399 -0.0000756 0.0000714 -0.225527 -0.5470018 0.1283779 -0.0001364 0.9527067 -0.1667307 0.0001054 -0.0000634 0.0000248 0.0823033 -0.5996655 0.0392312 -0.0000429 0.1781818 -0.2954351 -0.0000176 -0.00036 0.0000742 -0.184601 -1.4589336 -0.140449 -0.0000829 -0.4623807 -0.356192 0.000002 -0.0001661 -0.0000233 -0.2235656 2.4043634 -0.1730765 0.0001523 -0.6556122 1.1541891 -0.0002001 0.000175 -0.0001633 0.19447 1.0680066 -0.0878041 0.0000751 -0.6380796 0.1048201 -0.0000352 0.0001838 -0.0000057 0.091756 1.7786987 0.14877 0.0001996 0.5658709 0.3500491 0.0000205 0.0001512 -0.0000474 0.0663354 -0.5583401 -0.0152205 -0.0000499 -0.1031707 0.0012971 -0.0000067 0.0001527 0.0000127 0.0120383 0.9615343 -0.0490057 0.0000966 0.0389293 -0.0119349 -0.0000074 0.0000617 -0.0000247 -0.0101475 -0.3113354 0.0816524 -0.0000088 -0.0211604 0.1240803 -0.0000304 -0.0000287 -0.0000234 -0.1187499 -1.3203842 0.1420389 -0.0001081 0.1738202 -0.0962388 0.0000173 -0.0000832 0.0000495 0.0105826 0.0446613 -0.0036533 -0.0000009 -0.2487233 0.1144379 -0.0000233 0.0000474 -0.0000326 -0.0934195 0.1088853 -0.0931766 0.0000408 0.2363664 -0.0101947 -0.0000107 0.000008 -0.000034 -0.130239 0.1070273 0.0979025 -0.0000055 -0.2120969 0.0014976 -0.0000465 0.0000582 -0.000026 -0.12522 -0.2684255 0.1253856 -0.0000397 0.2659011 0.1091098 -0.0000338 -0.0000935 -0.0000487 -0.1504689 -0.0924886 -0.1706857 0.0000418 -0.3060492 0.0293114 -0.0000684 0.0000593 -0.0000557 -0.1536168 0.0848246 0.0102646 0.0000177 -0.0347715 0.0129931 -0.0000385 0.0000287 -0.0000344 -0.1439653 0.1198103 -0.001946 -0.0000008 -0.0284173 0.1300384 0.0000077 -0.0000114 0.000018 0.1953434 0.0855883 0.025751 -0.0000065 0.003403 0.011667 0.0000193 -0.0000211 0.0000278 0.1685271 0.084998 -0.061616 0.0000039 0.0051066 0.1150183 0.0000084 0.0000004 0.0000027 0.1775864 0.0836163 0.0870391 -0.000026 0.082262 0.0246412 0.0000345 -0.0000144 0.0000378 0.1542031 0.1438773 -0.0584434 0.0000149 -0.0578116 -0.0000066 0.0000322 0.0000223 0.0000321 0.1553195 0.0234663 -0.0670626 0.0000015 -0.1110842 -0.0844107 0.000045 0.0000091 0.0000492 0.1583061 -0.0262392 0.087686 -0.0000372 0.1281887 -0.0393389 0.0000555 -0.0000468 0.0000533 0.1587224 -0.1419341 -0.0274513 -0.0000211 -0.0307166 0.0908074 0.0000125 -0.0000146 0.0000129 0.1594879 unknown
polarizability: 374.5813665|3.8562226|165.214317|0.0227956|-0.0177369|61.4927247 unknown
InChI: InChI=1S/C12H8N4O2/c17-16(18)10-6-7-11-13-12(14-15(11)8-10)9-4-2-1-3-5-9/h1-8H
charge 0 multiplicity 1
26 atoms
O  5.599358 0.131113 0.000134
O  4.646701 -1.947748 0.000413
N  0.897129 -0.274117 0.000016
N  -0.334626 -0.925012 0.000232
N  -0.624837 1.402868 -0.000292
N  4.5752 -0.656347 0.000256
C  0.705006 1.151261 -0.000177
C  -1.218753 0.137499 -0.000295
C  -2.671696 -0.059652 -0.000389
C  2.123686 -0.876678 0.000127
C  1.859643 1.982834 -0.000231
C  3.238059 -0.035649 0.000061
C  3.123039 1.392329 -0.000121
C  -3.227356 -1.368375 -0.000136
C  -3.530888 1.072008 -0.000714
C  -4.62582 -1.538379 -0.000229
C  -4.929135 0.894166 -0.0008
C  -5.480743 -0.409305 -0.000559
H  2.181967 -1.964932 0.000317
H  1.726708 3.066288 -0.000369
H  4.03759 1.989169 -0.000147
H  -2.556953 -2.233729 0.000124
H  -3.084684 2.071266 -0.000904
H  -5.051585 -2.547525 -0.00004
H  -5.58928 1.76816 -0.001054
H  -6.567933 -0.545012 -0.000625
