program: Gaussian 09
title: 000272194
version: EM64L-G09RevD.01
frameworkgroup: C1[X(C6H4N4O2)]
method: RPBEPBE
basis: SDD
operation: Freq
keyword: #pfreq=noraman
keyword: PBEPBE/SDD
title: #p freq=noraman PBEPBE/SDD
converged: NO YES NO YES
title: Mulliken charges:
elementType: O O N N N N C C C C C C H H H H
charge: -0.153955 -0.214537 -0.226673 -0.054153 -0.038689 0.031369 0.208008 0.244764 -0.186351 -0.260179 -0.185569 -0.284468 0.291485 0.302039 0.251387 0.275521
chargesum: 0.00000
title: Mulliken charges with hydrogens summed into heavy atoms:
elementType: O O N N N N C C C C C C
charge: -0.153955 -0.214537 -0.226673 -0.054153 -0.038689 0.031369 0.208008 0.244764 0.105135 0.041860 0.065818 -0.008947
polarizability: 1.35322099e+02 8.83059734e+00 1.27669980e+02 -7.97805095e-03 1.27280459e-03 3.81492648e+01
1716.lowfreq: -7.1228 -4.6149 -0.9990 -0.0007 -0.0007 -0.0006 24.6549 123.3907 190.8553
frequency: 24.4907 123.3901 190.8553 221.0307 257.8344 360.8589 385.6325 463.8900 478.2052 563.5865 602.6281 636.2063 643.2885 690.4979 733.0249 741.7962 800.4746 845.0175 879.3280 900.0305 931.7419 932.2183 975.1769 1054.0226 1091.5847 1139.0904 1169.0689 1181.2660 1205.8546 1215.0735 1286.4957 1332.6164 1370.3014 1379.0873 1440.4143 1503.1893 1533.2379 1625.1352 3179.4898 3192.9885 3212.8146 3252.9516
redmass: 12.9076 8.8820 10.1290 4.6757 4.9630 10.3231 9.9009 5.3042 7.2589 3.5270 8.2310 4.2844 6.0472 9.1023 11.7823 3.4940 1.6627 5.9876 1.3744 10.7293 1.3506 7.7845 1.3480 2.3517 2.6528 2.9042 2.5086 1.7868 4.9164 4.5615 2.9528 2.1868 2.6401 7.7556 3.2571 5.4313 6.5964 8.2122 1.0895 1.0924 1.1006 1.0989
irintensity: 0.4460 0.2846 0.7956 1.6773 0.0923 0.2374 1.7213 9.9470 2.1266 4.2605 5.3047 5.3974 0.2557 7.0108 25.7289 35.8769 44.4403 5.5700 20.6261 0.1301 0.0588 11.1251 3.3862 1.5728 35.7232 5.9175 139.6293 55.6841 162.8660 31.1894 50.7614 15.5338 14.1665 108.3891 2.9533 28.8237 30.3690 29.1580 2.9388 6.0307 0.4338 0.4827
temp: 298.150 k
press: 1.00000 atm
elementType: 8 8 7 7 7 7 6 6 6 6 6 6 1 1 1 1
symmnumber: 1
zpe: 273621.2 jmol-1
zpe.correction: 0.104217 hartree
zpe.thermalcorrener: 0.112903 hartree
zpe.thermalcorrenthalpy: 0.113847 hartree
zpe.thermalcorrgfe: 0.069015 hartree
zpe.sumelectzpe: -599.531751 hartree
zpe.sumelectthermal: -599.523065 hartree
zpe.sumelectthermalent: -599.522121 hartree
zpe.sumelectthermalfe: -599.566953 hartree
dipole: -3.5705 5.0454 0.0007
dipole: 6.1810
quadrupole: -78.8755 -61.7977 -68.0194
quadrupole: 3.8305 0.0017 -0.0001
quadrupole: -9.3113 7.7665 1.5448 3.8305 0.0017 -0.0001
hfenergy: -599.6359676 hartree
pointgroup: C01 [X(C6H4N4O2)]
dipole: -1.3532043 -2.0205299 -0.0002618 debye
dipolederiv: -0.467146 -0.1129224 -0.0000406 -0.1003107 -0.6680522 0.0000321 -0.0000409 -0.000067 -0.1857549 -0.9352814 0.1215875 -0.0000458 0.1132485 -0.4758845 -0.0000136 -0.0001432 0.000039 -0.2342309 0.113849 -0.3748667 -0.0000104 0.2390161 -0.4959953 0.0000244 0.000012 -0.0000315 0.0730693 -0.6913703 0.1819 -0.0000186 0.4089012 -0.5109706 0.0000303 -0.0000283 0.0000062 -0.2125376 -0.2572574 0.0546209 -0.0000145 -0.1587864 -0.3763566 -0.0000289 0.0000091 0.0000038 -0.185922 1.6815322 0.1867067 0.0001603 0.3157156 1.0957087 0.0000239 0.0001892 0.0000236 0.1900471 -0.032875 0.0645606 -0.0000027 -0.5028598 0.5962994 -0.0000339 -0.0000061 0.0000156 0.0890167 -0.3967152 -0.1517396 -0.0000602 -0.4703822 -0.2639231 -0.000056 -0.0000378 -0.000009 0.0640679 0.3133828 0.029393 0.0000263 -0.3788024 0.2166903 -0.0000324 0.000007 0.0000056 -0.0363788 0.1492799 0.0892097 0.0000119 0.3705907 0.1284371 0.0000409 0.0000426 0.0000141 -0.064859 -0.4786082 -0.1186123 -0.0000325 0.0279528 0.0712317 0.0000086 -0.0000098 -0.0000037 -0.1756023 0.6733315 -0.0197671 0.0000454 0.0846273 0.4201846 0.0000119 0.0000176 0.0000305 -0.0246975 0.0683625 -0.0300699 -0.0000072 0.0014525 0.0825833 -0.0000024 -0.0000057 -0.0000031 0.1901329 0.0882237 0.040797 -0.000001 0.0198689 0.1390916 -0.0000005 -0.0000042 0.0000037 0.1748531 0.0941852 -0.0023255 -0.0000062 -0.0181363 -0.0309555 -0.000007 -0.0000131 -0.0000043 0.1718155 0.0771067 0.0415281 -0.0000042 0.047904 0.0719111 0.0000026 0.0000117 -0.0000234 0.1669804 unknown
polarizability: 135.7714435|-8.6220126|127.2206351|0.0079426|0.0014777|38.1492648 unknown
InChI: InChI=1S/C6H4N4O2/c11-10(12)5-2-1-3-9-6(5)7-4-8-9/h1-4H
charge 0 multiplicity 1
16 atoms
O  2.137676 1.802638 0.000131
O  3.267819 -0.182576 0.00024
N  -1.526456 -0.391301 -0.000245
N  -0.774572 1.751802 -0.000155
N  -2.684554 0.391048 -0.000261
N  2.177935 0.519275 -0.000004
C  -0.361711 0.455374 -0.000159
C  0.895732 -0.226308 -0.000098
C  -1.498873 -1.764544 -0.000275
C  0.941534 -1.625216 -0.000131
C  -0.258298 -2.396507 -0.000226
C  -2.154847 1.65393 -0.000284
H  -2.462943 -2.275249 -0.000335
H  1.923531 -2.105389 -0.000082
H  -0.214362 -3.487307 -0.00025
H  -2.805614 2.525031 -0.000267
