program: Gaussian 09
title: 000272189
version: EM64L-G09RevD.01
frameworkgroup: C1[X(C16H11BrO2)]
method: RPBEPBE
basis: SDD
operation: Freq
keyword: #p
keyword: freq=noraman
keyword: PBEPBE/SDD
title: #p freq=noraman PBEPBE/SDD
converged: YES YES NO NO
title: Mulliken charges:
elementType: Br O O C C C C C C C C C C C C C C C C H H H H H H H H H H H
charge: 0.059492 -0.373722 -0.241354 -0.125663 -0.246871 -0.509881 0.298010 0.356714 0.163797 0.161457 0.235998 -0.449588 -0.447763 -0.398400 -0.396200 -0.267637 -0.255880 -0.236657 -0.238426 0.282424 0.288165 0.286594 0.260652 0.245284 0.244943 0.229321 0.227843 0.229255 0.229184 0.388911
chargesum: 0.00000
title: Mulliken charges with hydrogens summed into heavy atoms:
elementType: Br O O C C C C C C C C C C C C C C C C
charge: 0.059492 0.015189 -0.241354 -0.125663 -0.246871 0.060708 0.298010 0.356714 0.163797 0.161457 0.235998 -0.162994 -0.187111 -0.153116 -0.151257 -0.038316 -0.028037 -0.007403 -0.009243
polarizability: 2.21130812e+02 -1.95866945e+01 2.54000252e+02 -1.82363323e+01 -1.00993963e+01 1.13715404e+02
1716.lowfreq: -9.7947 0.0002 0.0005 0.0006 1.8983 6.2884 47.5177 49.7321 55.9385
frequency: 47.4659 49.7187 55.9353 94.6483 115.3904 153.8786 164.9519 179.1939 200.2604 210.2765 285.8064 311.7403 340.9084 391.2331 415.4976 433.4084 452.9282 468.6392 478.5593 512.1812 555.5705 570.2574 592.2381 604.3859 617.7704 619.8945 665.5135 702.0200 749.6665 751.2267 755.8433 767.0974 793.7651 796.4465 814.8368 825.1552 880.6892 888.6504 948.8822 957.3993 982.6540 987.0528 990.4118 996.3390 1011.4020 1027.8558 1045.8436 1052.2326 1080.3864 1087.7471 1113.8963 1119.0334 1164.7302 1174.1535 1182.1448 1221.3749 1245.2185 1300.1942 1308.0320 1312.6245 1350.6304 1380.6422 1405.5188 1438.8759 1440.5288 1446.7001 1469.7300 1486.7962 1589.6421 1591.8242 1617.5252 1619.5737 1621.0749 3096.5601 3126.5781 3127.7936 3138.0861 3139.9749 3151.4126 3154.5918 3166.1845 3167.4113 3202.4873 3523.5344
redmass: 9.5295 8.8503 5.8619 6.8991 5.0572 7.3010 5.9579 6.0044 5.9045 5.2332 4.2653 9.2481 2.9519 4.3721 5.7906 3.4550 4.5889 3.0742 3.8608 5.2901 2.7799 3.3949 4.3870 3.3246 3.2661 2.7079 4.8547 5.6427 1.6425 1.9961 3.1625 7.7595 2.1018 2.9056 3.1225 2.1414 1.4136 1.4787 1.4224 1.4043 6.3268 1.3583 1.3278 6.8339 2.3350 2.2370 2.1673 2.0179 2.2961 1.3792 1.7865 1.6507 1.7443 1.1086 1.3096 2.3053 2.0133 2.2350 1.7477 2.1252 3.8236 8.4877 3.6573 1.2139 2.2034 2.6538 2.6732 3.9743 6.7661 6.5203 7.7669 7.6332 7.6279 1.0568 1.0856 1.0855 1.0899 1.0904 1.0945 1.0948 1.0999 1.0994 1.1154 1.0641
irintensity: 0.4771 0.9906 0.1056 0.3031 1.9659 0.3121 0.2907 0.4571 0.5286 0.7480 0.2429 2.1627 1.3780 0.0905 3.6361 5.9819 20.4235 1.7156 17.8251 0.5436 26.7410 0.5704 3.3605 46.6829 38.1625 83.8349 12.6548 2.5097 108.5823 6.6231 21.7387 5.6591 6.6475 20.2095 3.4918 5.9339 0.2796 0.4964 0.6771 3.4935 18.0344 0.1921 0.1421 2.2460 8.8435 3.6724 65.7921 115.5296 36.4201 4.9237 37.8151 23.5591 32.8214 2.4686 9.8883 4.2121 4.0068 11.7146 7.0007 19.2868 59.5588 8.8376 0.6932 29.9381 28.9933 27.3012 10.2371 8.5818 0.9191 1.7621 37.1872 74.1566 83.3311 2.4049 2.8494 0.0415 10.4262 6.7058 22.2220 24.1599 38.9049 11.1123 0.0774 48.5319
temp: 298.150 k
press: 1.00000 atm
elementType: 35 8 8 6 6 6 6 6 6 6 6 6 6 6 6 6 6 6 6 1 1 1 1 1 1 1 1 1 1 1
symmnumber: 1
zpe: 580649.0 jmol-1
zpe.correction: 0.221158 hartree
zpe.thermalcorrener: 0.236635 hartree
zpe.thermalcorrenthalpy: 0.237579 hartree
zpe.thermalcorrgfe: 0.177426 hartree
zpe.sumelectzpe: -778.893408 hartree
zpe.sumelectthermal: -778.877931 hartree
zpe.sumelectthermalent: -778.876986 hartree
zpe.sumelectthermalfe: -778.937140 hartree
dipole: 1.2944 0.3575 -0.0729
dipole: 1.3448
quadrupole: -111.4722 -106.6544 -118.3116
quadrupole: -1.4294 -4.6185 5.2717
quadrupole: 0.6739 5.4917 -6.1656 -1.4294 -4.6185 5.2717
hfenergy: -779.1145652 hartree
pointgroup: C01 [X(C16H11Br1O2)]
dipole: -0.3321274 -0.4110947 -0.0249982 debye
polarizability: 235.5657409|-23.5574083|242.0253428|-14.6117386|-0.4491631|111.255385 unknown
InChI: InChI=1S/C16H11BrO2/c17-16(14(18)19)9-15(16)12-7-3-1-5-10(12)11-6-2-4-8-13(11)15/h1-8,18H,9H2
charge 0 multiplicity 1
30 atoms
Br 0.835922 3.291061 0.83055
O  2.734134 1.089526 1.875913
O  3.622662 0.62651 -0.213799
C  0.288959 0.543027 -0.557648
C  1.384429 1.595986 -0.058726
C  1.100397 1.413966 -1.533113
C  0.504499 -0.941639 -0.358538
C  -1.181583 0.751878 -0.291972
C  -0.715617 -1.526991 0.103923
C  -1.755404 -0.483171 0.142617
C  2.683951 1.070977 0.490004
C  1.637043 -1.74681 -0.587823
C  -1.987089 1.894656 -0.444866
C  -0.793554 -2.907389 0.376398
C  -3.125971 -0.566016 0.460645
C  1.551789 -3.136422 -0.318326
C  -3.36653 1.807541 -0.12996
C  0.352843 -3.710364 0.169443
C  -3.928844 0.591373 0.328632
H  0.55487 2.212399 -2.043231
H  1.888207 0.937003 -2.125279
H  2.569483 -1.326198 -0.975754
H  -1.570779 2.841189 -0.80196
H  -1.727966 -3.357563 0.729056
H  -3.568929 -1.511321 0.792673
H  2.424992 -3.77378 -0.495491
H  -4.004591 2.690585 -0.244308
H  0.309824 -4.786042 0.373107
H  -4.996403 0.545674 0.57076
H  3.609353 0.723055 2.176671
