program: Gaussian 09
title: 000272178
version: EM64L-G09RevD.01
frameworkgroup: C1[X(C15H22O3)]
method: RPBEPBE
basis: SDD
operation: Freq
keyword: #pfreq=noraman
keyword: PBEPBE/SDD
title: #p freq=noraman PBEPBE/SDD
converged: YES YES NO NO
title: Mulliken charges:
elementType: O O O C C C C C C C C C C C C C C C H H H H H H H H H H H H H H H H H H H H H H
charge: -0.273392 -0.454012 -0.258724 0.041793 -0.393340 -0.413106 -0.366498 -0.350205 -0.693316 -0.694971 0.210176 -0.300837 0.375741 -0.363895 -0.384155 -0.225455 -0.218599 -0.240482 0.225713 0.229033 0.201685 0.206423 0.202901 0.203967 0.202500 0.195833 0.221212 0.217679 0.212878 0.218998 0.212257 0.221396 0.207699 0.260694 0.247764 0.269197 0.366453 0.224839 0.226452 0.227703
chargesum: 0.00000
title: Mulliken charges with hydrogens summed into heavy atoms:
elementType: O O O C C C C C C C C C C C C C C C
charge: -0.273392 -0.087559 -0.258724 0.267507 0.037378 -0.003781 0.039968 0.066840 -0.043760 -0.053619 0.210176 -0.040143 0.375741 -0.116131 -0.114958 -0.000616 0.007853 -0.012780
polarizability: 1.94498131e+02 -1.40850652e+01 1.51966384e+02 7.51283970e+00 1.43198281e+01 1.56055824e+02
1716.lowfreq: -10.9956 -8.2134 -0.0008 -0.0008 -0.0002 2.1059 10.4405 19.4792 34.8576
frequency: 9.1031 19.4190 34.7743 45.2670 56.5655 66.2543 72.9839 75.4677 95.7605 150.9817 161.2980 189.6918 214.9032 228.3520 233.6505 247.7489 266.2966 301.8401 304.1483 331.8624 382.6242 404.4924 434.4789 450.7514 471.0226 501.3832 509.3529 587.4926 614.8612 658.0345 699.3186 717.0442 732.0717 741.8296 762.8741 789.8798 837.0419 843.9293 858.7544 886.8503 895.4719 901.5552 907.7625 936.4437 978.0820 982.2506 989.6671 1000.3252 1016.7631 1028.9186 1036.7881 1048.3694 1070.0946 1083.0529 1084.9376 1112.7979 1139.1963 1162.9007 1170.1032 1171.6193 1173.9207 1189.0085 1218.1235 1224.8565 1242.2755 1266.3541 1272.1159 1273.7173 1291.1139 1296.0787 1318.0776 1327.1842 1337.0276 1355.4318 1361.7997 1368.3873 1387.6327 1390.5661 1391.7140 1434.8606 1450.8597 1462.6835 1474.0450 1474.4818 1476.1657 1478.2276 1479.2087 1485.8556 1486.7116 1593.4432 1605.6272 1613.3915 2972.0052 2972.8346 2974.8239 2976.5169 2982.6154 2986.3109 3010.2769 3017.4727 3025.0739 3027.6759 3047.0234 3053.2792 3071.9485 3074.4356 3075.5977 3077.7944 3122.0566 3131.6776 3144.6429 3157.9539 3169.8512 3448.2955
redmass: 4.2165 4.2539 4.0526 3.1597 1.8204 2.5325 4.3644 2.0984 4.3720 3.9770 2.4564 3.9440 4.3954 1.2056 1.2205 2.6650 5.5165 3.0135 4.0620 5.6967 2.6645 3.1768 1.3964 2.4107 3.6325 3.5007 3.9744 6.3479 6.4278 5.6099 3.3095 1.6502 1.3213 1.1310 2.7453 2.2315 3.5973 1.3890 1.2461 1.8315 2.9753 1.6909 1.8424 1.5370 2.2178 1.4674 4.3143 1.3517 4.4833 2.2800 2.1862 1.6980 2.1245 2.1698 1.6420 2.1891 2.2984 2.6285 1.2439 2.0761 1.5257 1.2815 1.4262 1.8364 1.3113 1.3519 1.2607 1.2178 1.1134 1.1350 1.3162 1.2989 1.3908 1.4680 1.6734 1.6436 3.9839 1.2112 1.2180 2.1809 1.0805 1.0826 1.0569 1.0558 1.0449 2.2111 1.0428 1.0767 1.0797 6.2609 7.6729 6.9754 1.0566 1.0431 1.0559 1.0377 1.0604 1.0599 1.0854 1.0998 1.0958 1.0843 1.1015 1.1026 1.1013 1.1008 1.0991 1.0998 1.0846 1.0884 1.0937 1.0972 1.0978 1.0648
irintensity: 0.3242 0.1660 0.1182 0.4348 0.0705 0.1943 0.4225 0.5201 0.0583 0.9274 0.2115 5.3574 2.4008 0.2852 0.3875 2.1330 3.2065 0.1482 10.7756 19.6277 50.1719 0.6275 71.6612 24.9558 2.3936 1.9775 22.8132 11.6093 0.5733 10.2589 8.0076 68.1291 21.9362 14.3560 16.3060 28.7494 3.7427 4.0014 0.5382 32.6270 5.6526 12.1351 5.5787 3.6644 9.4324 0.4707 0.3894 0.9007 128.4389 28.7139 3.5045 4.2080 15.5306 3.5439 7.5400 62.4355 20.0567 201.9235 4.7722 22.0274 7.2195 3.6474 8.7358 187.6890 4.1655 2.6493 3.9470 1.9150 0.3499 2.7892 4.1974 0.1528 1.1153 0.8594 10.3948 40.1170 10.5455 9.9772 9.1562 13.0601 3.7934 2.3943 3.8020 3.1552 13.0413 22.5556 13.0226 12.7237 13.4461 2.1415 108.3681 50.4423 32.1750 24.0708 13.7318 23.9978 44.3149 31.1196 11.4297 5.5051 3.2852 11.7140 15.2134 15.6230 84.5038 68.0424 48.4730 56.7149 0.4064 7.6514 27.3120 21.5368 14.2580 41.4173
temp: 298.150 k
press: 1.00000 atm
elementType: 8 8 8 6 6 6 6 6 6 6 6 6 6 6 6 6 6 6 1 1 1 1 1 1 1 1 1 1 1 1 1 1 1 1 1 1 1 1 1 1
symmnumber: 1
zpe: 887800.6 jmol-1
zpe.correction: 0.338145 hartree
zpe.thermalcorrener: 0.358139 hartree
zpe.thermalcorrenthalpy: 0.359083 hartree
zpe.thermalcorrgfe: 0.285688 hartree
zpe.sumelectzpe: -809.079198 hartree
zpe.sumelectthermal: -809.059205 hartree
zpe.sumelectthermalent: -809.058260 hartree
zpe.sumelectthermalfe: -809.131656 hartree
dipole: 2.6948 2.0841 1.8689
dipole: 3.8856
quadrupole: -102.4308 -112.0302 -110.1226
quadrupole: -6.2087 -0.2963 -0.6693
quadrupole: 5.7637 -3.8357 -1.9281 -6.2087 -0.2963 -0.6693
hfenergy: -809.4173438 hartree
pointgroup: C01 [X(C15H22O3)]
dipole: -1.0192104 -0.9301214 0.6581075 debye
polarizability: 196.4322257|-10.4705146|152.1442064|-6.3365264|-15.2435537|153.943907 unknown
InChI: InChI=1S/C15H22O3/c1-3-8-13(9-4-2)18-15(17)14(16)12-10-6-5-7-11-12/h5-7,10-11,13-14,16H,3-4,8-9H2,1-2H3
charge 0 multiplicity 1
40 atoms
O  -0.797588 0.544093 0.100743
O  1.911736 2.342295 -1.508306
O  -0.078708 0.60212 -2.122279
C  -2.017781 -0.285894 -0.274213
C  -1.60113 -1.768244 -0.26189
C  -3.098947 0.105093 0.740193
C  -2.698233 -2.712658 -0.810588
C  -3.547045 1.580487 0.640089
C  -2.210767 -4.175185 -0.89512
C  -4.659785 1.928516 1.651298
C  0.079348 0.870426 -0.903085
C  1.317088 1.632759 -0.386763
C  2.306542 0.663046 0.289584
C  1.96624 0.010824 1.501698
C  3.576362 0.437676 -0.290077
C  2.886081 -0.86513 2.119245
C  4.494134 -0.442546 0.327878
C  4.152731 -1.097642 1.532787
H  -2.300731 0.018642 -1.30133
H  -0.693348 -1.883759 -0.884538
H  -1.329613 -2.064439 0.770614
H  -2.727727 -0.109586 1.762308
H  -3.973726 -0.554144 0.573435
H  -3.006683 -2.36784 -1.818454
H  -3.599975 -2.664611 -0.16916
H  -3.903904 1.78416 -0.39018
H  -2.672015 2.237023 0.806023
H  -1.334712 -4.261885 -1.564374
H  -1.911182 -4.552676 0.100546
H  -3.00251 -4.840216 -1.285144
H  -4.319619 1.759633 2.690421
H  -4.963089 2.987613 1.564703
H  -5.559343 1.305329 1.487044
H  0.982157 2.388283 0.346565
H  0.983498 0.183081 1.955094
H  3.838369 0.974176 -1.206863
H  1.591554 1.894716 -2.341123
H  2.616414 -1.363463 3.057431
H  5.476906 -0.609155 -0.127723
H  4.865999 -1.776911 2.013211
