program: Gaussian 09
title: 000272212
version: EM64L-G09RevD.01
frameworkgroup: C1[X(C20H17BrO3S)]
method: RPBEPBE
basis: SDD
operation: Freq
keyword: #p
keyword: freq=noraman
keyword: PBEPBE/SDD
title: #p freq=noraman PBEPBE/SDD
converged: YES YES NO NO
title: Mulliken charges:
elementType: Br S O O O C C C C C C C C C C C C C C C C C C C C H H H H H H H H H H H H H H H H H
charge: 0.019337 0.942389 -0.371067 -0.501442 -0.505504 0.253149 0.245791 0.113457 0.425069 -0.640717 -0.341649 -0.446966 -0.367799 -0.374310 -0.063417 -0.213665 -0.228849 -0.021891 -0.236984 -0.231882 0.451287 -0.360536 -0.357158 -0.796781 -0.590156 0.222010 0.257224 0.262405 0.245625 0.260902 0.263488 0.253174 0.240527 0.280532 0.281186 0.246065 0.245923 0.231580 0.245359 0.231830 0.212544 0.219922
chargesum: 0.00000
title: Mulliken charges with hydrogens summed into heavy atoms:
elementType: Br S O O O C C C C C C C C C C C C C C C C C C C C
charge: 0.019337 0.942389 -0.371067 -0.501442 -0.505504 0.253149 0.245791 0.113457 0.425069 -0.161483 -0.079244 -0.201341 -0.106896 -0.110822 -0.063417 0.039509 -0.228849 0.218636 0.043548 0.049304 0.451287 -0.114471 -0.111235 -0.088012 -0.157690
polarizability: 6.42868977e+02 -1.83328921e+01 2.67651475e+02 -3.86415173e-01 2.50735725e+01 1.63254317e+02
1716.lowfreq: -20.4490 -2.3617 -0.6495 -0.0013 0.0004 0.0008 7.9818 14.1952 16.3573
frequency: -20.3771 12.8637 16.3452 25.7399 36.6465 40.5320 44.9577 58.2595 74.3748 94.8829 112.0896 127.0819 133.4335 151.9400 168.7825 180.2648 217.1071 230.5456 253.7080 280.2323 284.4022 292.2603 307.5861 343.2147 372.9274 377.4040 398.7180 406.6114 415.8010 420.1344 422.1360 484.6813 493.3891 506.3319 522.1919 557.6002 569.8551 575.7298 588.2975 620.9072 651.1271 675.8164 703.3718 720.7635 759.3077 778.2207 782.1846 811.5235 824.5561 825.8359 830.8395 845.7588 858.0914 869.1047 902.0852 917.0365 931.3481 939.3260 962.7171 966.5907 971.8578 978.7213 982.5803 990.8562 991.1563 1010.9744 1048.9098 1051.5199 1060.8366 1071.5954 1112.2522 1120.1338 1156.9860 1179.3889 1185.8001 1202.8664 1212.4060 1219.2237 1227.6107 1267.9118 1283.9582 1297.0910 1298.2619 1343.1505 1381.8465 1382.5278 1393.7027 1396.6682 1399.3265 1420.1771 1423.4107 1435.9619 1456.0981 1470.3074 1472.2704 1473.4890 1492.2794 1542.6724 1586.6364 1592.9103 1593.8679 1609.0139 1649.8868 2981.3055 3003.6030 3058.9903 3064.2943 3083.2886 3094.3576 3102.9385 3137.5548 3138.4331 3140.1631 3156.3275 3161.7765 3164.7272 3168.0760 3172.7638 3182.2413 3193.9922
redmass: 1.0162 6.4443 6.9149 4.3600 3.8476 5.1029 7.0806 4.3870 8.3227 3.2543 4.6138 7.0218 9.4633 5.3660 6.0610 3.6555 8.1033 7.9365 7.5063 5.0156 4.8688 4.4713 4.1776 4.3964 7.6153 3.5272 3.2131 2.8652 5.7565 3.1588 5.7751 4.1368 4.4136 3.3908 5.6451 2.6728 3.5391 2.9692 5.9264 6.9606 3.3843 4.0691 3.3303 3.8617 5.6530 4.8915 2.2333 6.8754 1.4862 1.6448 1.8005 1.2456 2.2694 4.6497 1.5810 2.0024 15.4048 1.3613 1.2958 1.3678 2.3175 1.3726 1.3867 2.0356 2.5210 1.2215 1.6008 2.4465 2.9031 2.4953 1.9411 1.2830 1.2651 1.6675 1.1348 2.0622 2.0023 3.0353 1.6799 1.5514 1.2269 1.3571 1.2626 2.4816 4.6631 3.9626 3.0853 4.6661 1.2191 2.2213 1.9016 2.3308 1.1611 1.1029 2.0766 1.1281 3.5001 7.2584 6.6090 6.6302 6.2353 6.7009 4.6022 1.0392 1.0591 1.0997 1.0946 1.0603 1.1002 1.0946 1.0892 1.0892 1.0894 1.0926 1.0877 1.0956 1.0967 1.0968 1.0970 1.1139
irintensity: 0.6084 0.9666 0.9439 0.1598 0.1013 0.3210 0.3358 0.0736 8.3905 4.4820 0.0389 1.8228 4.4752 16.4997 1.5491 7.4000 42.8226 8.3444 37.5115 5.7315 4.6598 0.3048 5.1406 14.4590 17.0243 2.0239 21.3844 0.2035 6.4323 22.5648 124.6545 4.7206 3.3158 79.9174 3.0848 8.0202 16.0042 1.4798 64.6317 0.2533 4.7532 11.1119 0.4336 6.8279 32.6353 1.9231 11.1594 70.7430 14.9633 31.6190 44.8808 0.2284 11.8353 67.2475 35.9729 2.6422 55.9209 61.6924 0.8233 0.7277 6.3880 1.9114 0.1331 3.0938 6.4711 16.5212 38.0340 38.0580 2.3967 68.6623 8.8217 8.7466 14.7551 25.2056 34.2884 21.8645 24.9037 14.5473 9.9059 1.3405 1.5583 3.0136 2.5974 11.0870 2.2551 1.7643 9.9010 9.3231 17.1790 28.7850 31.8107 77.2083 10.9822 16.8449 28.0019 18.3102 29.5148 18.0906 31.5846 3.7051 10.8954 201.0101 19.7007 26.5406 12.0046 4.1690 17.0950 11.0488 13.9120 8.4980 6.4343 11.6137 12.4883 4.5397 0.3242 2.1228 16.0242 5.2200 7.5519 25.7255
temp: 298.150 k
press: 1.00000 atm
elementType: 35 16 8 8 8 6 6 6 6 6 6 6 6 6 6 6 6 6 6 6 6 6 6 6 6 1 1 1 1 1 1 1 1 1 1 1 1 1 1 1 1 1
symmnumber: 1
zpe: 814773.6 jmol-1
zpe.correction: 0.310331 hartree
zpe.thermalcorrener: 0.334391 hartree
zpe.thermalcorrenthalpy: 0.335335 hartree
zpe.thermalcorrgfe: 0.251852 hartree
zpe.sumelectzpe: -1407.578961 hartree
zpe.sumelectthermal: -1407.554901 hartree
zpe.sumelectthermalent: -1407.553957 hartree
zpe.sumelectthermalfe: -1407.637440 hartree
dipole: 4.4920 2.7059 -2.8519
dipole: 5.9694
quadrupole: -125.2353 -155.8618 -170.0709
quadrupole: 7.3256 -12.1368 11.6353
quadrupole: 25.1540 -5.4724 -19.6816 7.3256 -12.1368 11.6353
hfenergy: -1407.8892916 hartree
pointgroup: C01 [X(C20H17Br1O3S1)]
dipole: 1.8294852 -1.0317472 1.0507813 debye
polarizability: 641.0213395|30.5847916|268.0994751|-13.2075525|26.2993674|164.6539544 unknown
InChI: InChI=1S/C13H10BrO.C7H7O2S/c1-2-3-12-11-6-5-10(14)8-9(11)4-7-13(12)15;1-6-2-4-7(5-3-6)10(8)9/h2,4-8H,1,3H2;2-5H,1H3
charge 0 multiplicity 1
42 atoms
Br -7.58751 0.168912 0.241879
S  1.868901 1.271525 -1.051991
O  0.789427 0.385203 0.486763
O  1.758329 2.892212 -0.925575
O  1.499552 0.522729 -2.452801
C  -1.389045 -0.533218 -0.040201
C  -2.819523 -0.388396 0.039261
C  -0.575632 0.539434 0.423512
C  -3.395209 0.856857 0.515568
C  -0.731597 -1.799916 -0.571486
C  -1.154053 1.776916 0.884122
C  -2.530835 1.931051 0.925375
C  -3.717113 -1.439385 -0.354754
C  -4.816386 1.008103 0.569572
C  3.559005 0.713767 -0.471088
C  -5.103042 -1.279547 -0.29686
C  -5.639341 -0.043072 0.167762
C  -0.709906 -2.934103 0.445727
C  4.056599 -0.505393 -0.958581
C  4.255711 1.533175 0.43187
C  6.084014 -0.124583 0.39603
C  5.33269 -0.914397 -0.514991
C  5.529121 1.098717 0.858762
C  7.465582 -0.563503 0.843347
C  -1.105854 -4.207841 0.199751
H  -1.229896 -2.136997 -1.498821
H  0.31099 -1.550032 -0.839059
H  -0.473014 2.574222 1.196658
H  -2.977187 2.868543 1.27502
H  -3.310274 -2.395586 -0.693152
H  -5.242993 1.950659 0.926145
H  -5.773017 -2.089444 -0.597821
H  -0.313305 -2.668188 1.436593
H  3.475658 -1.101759 -1.669042
H  3.825301 2.47886 0.775308
H  5.747974 -1.860476 -0.880168
H  6.097135 1.717864 1.562258
H  7.565653 -1.66245 0.834919
H  8.243025 -0.157079 0.167743
H  7.696059 -0.204267 1.861102
H  -1.500721 -4.511712 -0.778672
H  -1.036272 -4.987504 0.966215
