program: Gaussian 09
title: 000272214
version: EM64L-G09RevD.01
frameworkgroup: C1[X(C26H24N2O6)]
method: RPBEPBE
basis: SDD
operation: Freq
keyword: #p
keyword: freq=noraman
keyword: PBEPBE/SDD
title: #p freq=noraman PBEPBE/SDD
converged: YES YES NO NO
title: Mulliken charges:
elementType: O O O O O O N N C C C C C C C C C C C C C C C C C C C C C C C C C C H H H H H H H H H H H H H H H H H H H H H H H H
charge: -0.254328 -0.254328 -0.287643 -0.287643 -0.261366 -0.261367 -0.471783 -0.471783 0.266984 0.266984 0.506237 0.506237 -0.362541 -0.348891 -0.348891 -0.362540 0.125525 0.125525 0.237837 0.237837 -0.333990 -0.333990 -0.451872 -0.451871 -0.338155 -0.338155 -0.334940 -0.334940 0.177729 0.177729 -0.219863 -0.219863 -0.674180 -0.674180 0.279959 0.220556 0.220556 0.279959 0.315289 0.315289 0.310592 0.310592 0.224204 0.224204 0.271424 0.271424 0.271793 0.271793 0.229251 0.229390 0.229251 0.229390 0.212411 0.230115 0.230253 0.212412 0.230115 0.230253
chargesum: 0.00000
title: Mulliken charges with hydrogens summed into heavy atoms:
elementType: O O O O O O N N C C C C C C C C C C C C C C C C C C C C C C C C C C
charge: -0.254328 -0.254328 -0.287643 -0.287643 -0.261366 -0.261367 -0.156494 -0.156494 0.266984 0.266984 0.506237 0.506237 -0.082582 -0.128335 -0.128335 -0.082581 0.125525 0.125525 0.237837 0.237837 -0.023398 -0.023397 -0.227667 -0.227667 -0.066730 -0.066731 -0.063147 -0.063147 0.177729 0.177729 0.238778 0.238778 -0.001401 -0.001401
polarizability: 7.42141379e+02 1.14124276e+01 2.88330199e+02 4.93490264e-03 -2.28331731e-03 1.63326170e+02
1716.lowfreq: -1.1642 -0.3424 -0.0010 0.0006 0.0019 8.2771 9.3867 14.6376 17.5052
frequency: 8.2759 14.2960 17.5044 29.0936 39.4245 43.0758 47.6688 51.4512 59.1209 70.3675 74.7160 77.8159 80.0171 82.7213 95.6651 107.3298 116.6498 133.8016 150.2305 168.1418 178.1985 215.7191 224.8842 236.7487 249.4259 252.8275 267.2853 287.3513 299.9718 322.6374 328.4123 341.0126 351.9215 356.5144 378.5196 403.1626 405.5803 413.1247 413.7126 428.2390 478.4533 481.3731 502.1132 510.5181 515.8125 522.5323 618.5737 627.9940 630.3728 634.3307 636.3825 654.2811 654.4955 671.8270 680.1512 680.4158 705.1944 710.3437 760.4119 760.8305 775.1737 785.9641 788.7050 799.9559 799.9570 819.4440 823.7439 843.8054 843.8937 845.5096 848.7323 850.8588 859.5912 864.2286 881.4224 882.8001 883.3470 983.5552 983.6013 984.6220 993.0717 1004.5747 1004.6537 1008.0458 1009.3994 1009.4089 1022.9543 1023.0225 1064.6467 1065.5242 1084.0710 1096.9191 1112.6322 1112.6333 1121.8328 1122.7587 1126.6349 1136.4864 1136.4874 1183.0368 1183.1302 1195.5098 1243.5134 1246.1407 1249.1578 1249.1707 1249.4102 1252.2156 1263.9536 1264.2151 1306.7799 1306.7967 1312.6365 1359.6845 1359.7300 1370.6678 1371.1906 1374.4208 1400.9278 1400.9290 1406.5976 1421.4163 1421.7129 1464.1253 1464.1258 1473.9295 1473.9419 1484.3274 1486.9507 1487.0470 1496.1258 1503.7855 1504.8886 1507.2084 1557.1378 1584.3255 1586.1372 1599.3766 1608.8902 1615.0794 1615.9200 1616.7459 1622.6647 1625.3749 2995.2871 2995.2916 3008.8780 3008.8865 3066.9690 3066.9718 3091.9300 3091.9379 3106.4742 3106.4773 3115.1395 3115.1483 3120.9051 3122.2595 3163.5680 3163.5752 3164.1030 3166.9589 3172.4193 3172.4226 3201.5793 3201.5897 3528.4181 3528.4794
redmass: 6.5376 5.5876 4.7351 6.3711 4.0072 5.2152 3.3033 3.1643 4.8283 6.2467 5.2564 3.2717 4.0936 4.8212 6.1661 3.6640 3.5173 5.7520 3.5869 3.8091 5.7003 6.8639 5.2914 3.2050 1.3000 1.6885 4.8840 5.2702 7.6343 5.4027 5.4766 5.0439 3.8655 4.9490 7.4478 2.8712 5.9999 2.9876 2.9793 4.7277 4.8111 6.2951 6.7089 4.2036 2.9063 3.0772 6.0639 6.4541 7.0816 6.8202 4.4085 1.3002 1.4827 4.4597 4.1950 4.0685 3.3594 6.1316 4.3729 4.3744 5.1058 5.6896 5.9223 1.1028 1.1028 4.6072 4.4675 1.4289 1.4117 4.6831 4.7566 1.3823 2.5358 4.5982 2.8020 1.5007 1.7250 1.3618 1.3606 1.3939 1.3863 3.3426 3.3434 3.2608 1.3360 1.3339 2.2952 2.2867 6.3462 5.3929 4.5241 2.7673 2.2118 2.2118 1.3553 1.3477 1.3933 1.4648 1.4648 1.1586 1.1553 1.1486 2.5381 3.6085 1.1671 1.1343 2.3080 2.9268 2.6389 2.2575 1.3668 1.4365 1.3654 1.4262 1.4281 4.7680 5.0522 5.0008 1.2711 1.2711 4.0335 4.6072 4.4953 1.0401 1.0401 1.0608 1.0603 2.1238 1.0773 1.0879 2.2575 2.7481 2.5374 2.9680 6.9183 6.9411 5.3694 4.6357 6.2376 9.0498 6.3462 6.7590 6.4554 6.7921 1.0358 1.0358 1.0582 1.0582 1.1065 1.1065 1.0985 1.0985 1.1025 1.1025 1.0900 1.0900 1.0897 1.0893 1.0946 1.0946 1.0939 1.0952 1.0907 1.0907 1.0955 1.0955 1.0758 1.0758
irintensity: 0.0101 0.0146 0.0268 0.1706 0.6837 0.2794 3.1990 0.0808 0.0723 0.5605 11.3280 1.8850 0.0148 2.3161 6.4276 0.9943 2.8870 0.1471 1.0558 1.1827 19.8761 0.4639 0.8955 4.0032 0.9157 3.2111 1.3077 0.4567 0.1408 4.0408 8.7958 31.7125 0.1557 3.1653 0.0000 0.1348 28.1631 0.0028 0.2536 0.1310 0.3203 3.5950 18.4958 2.2313 6.4144 38.9080 0.0002 1.0419 0.3897 1.7796 3.5594 40.6844 13.2974 9.2245 57.0457 8.2717 72.0766 5.0373 4.5562 32.1936 5.4313 6.4542 1.7210 2.3883 1.6304 14.1482 0.4561 9.3825 42.4729 44.1224 0.2111 1.2845 24.4724 32.1733 1.8088 15.5977 106.7484 0.2350 0.2293 3.5130 1.6895 63.0327 0.7648 44.9363 0.3657 2.0412 0.0774 80.1996 7.5675 1047.4737 4.9056 16.5508 3.6349 3.8626 33.5767 3.3199 34.4634 3.2498 8.1654 295.2745 0.0145 1.5211 912.6308 0.7422 0.2940 0.0104 6.0055 193.2651 0.6030 429.1572 2.2515 200.7575 0.3090 17.2642 0.0433 93.5450 312.0571 13.3650 32.3403 9.2721 3.4403 7.7980 41.8548 4.3379 20.0515 16.5293 0.2848 400.6591 2.5465 90.7546 14.4898 1122.0012 30.1046 30.2290 10.2112 46.6917 0.1324 264.9912 61.7595 415.6518 3.5818 15.0050 255.7230 0.2926 40.8399 5.7588 48.3862 2.9901 7.1813 9.7994 65.0399 6.3952 21.5486 68.2556 30.2099 4.6558 46.1786 0.0124 3.5361 3.4928 4.4322 0.0448 1.1579 0.5437 8.0023 1.2037 19.2027 3.4137
temp: 298.150 k
press: 1.00000 atm
elementType: 8 8 8 8 8 8 7 7 6 6 6 6 6 6 6 6 6 6 6 6 6 6 6 6 6 6 6 6 6 6 6 6 6 6 1 1 1 1 1 1 1 1 1 1 1 1 1 1 1 1 1 1 1 1 1 1 1 1
symmnumber: 1
zpe: 1177785.8 jmol-1
zpe.correction: 0.448595 hartree
zpe.thermalcorrener: 0.480666 hartree
zpe.thermalcorrenthalpy: 0.481611 hartree
zpe.thermalcorrgfe: 0.379176 hartree
zpe.sumelectzpe: -1563.665307 hartree
zpe.sumelectthermal: -1563.633236 hartree
zpe.sumelectthermalent: -1563.632291 hartree
zpe.sumelectthermalfe: -1563.734726 hartree
dipole: 0.0000 0.0000 0.6089
dipole: 0.6089
quadrupole: -189.5800 -197.1200 -204.5379
quadrupole: -22.6603 0.0006 -0.0004
quadrupole: 7.4993 -0.0407 -7.4586 -22.6603 0.0006 -0.0004
hfenergy: -1564.1139021 hartree
pointgroup: C01[X(C26H24N2O6)]
dipole: -0.0000034 0.0000059 0.2395725 debye
polarizability: 742.3626028|5.4590176|288.1089759|0.0049045|-0.0023478|163.3261699 unknown
InChI: InChI=1S/C26H24N2O6/c1-3-33-25(31)19-9-13-21(14-10-19)27-23(29)17-5-7-18(8-6-17)24(30)28-22-15-11-20(12-16-22)26(32)34-4-2/h5-16,27-28H,3-4H2,1-2H3
charge 0 multiplicity 1
58 atoms
O  3.252468 -1.777794 -0.803147
O  -3.252463 1.777753 -0.80327
O  10.11336 -0.574234 -0.007187
O  -10.113372 0.574221 -0.007382
O  10.065812 1.556906 0.939695
O  -10.065838 -1.556886 0.939576
N  3.730061 0.357994 0.052963
N  -3.730072 -0.358003 0.052912
C  1.400603 -0.263549 -0.407091
C  -1.400606 0.263522 -0.407125
C  5.147504 0.336126 0.128132
C  -5.147517 -0.336132 0.128056
C  0.46657 -1.330023 -0.429693
C  -0.916675 -1.072457 -0.42569
C  0.916672 1.072429 -0.425721
C  -0.466572 1.329995 -0.429757
C  2.863718 -0.634217 -0.41467
C  -2.863721 0.63419 -0.414743
C  7.975695 0.453421 0.336224
C  -7.975712 -0.453421 0.336103
C  5.936901 -0.762073 -0.313425
C  -5.936907 0.762051 -0.313556
C  5.783893 1.487335 0.674844
C  -5.783915 -1.487321 0.674799
C  7.338303 -0.691553 -0.206413
C  -7.338311 0.691534 -0.206565
C  7.181123 1.543991 0.777542
C  -7.181147 -1.543974 0.777475
C  9.453934 0.564861 0.465273
C  -9.453952 -0.564856 0.465129
C  11.604071 -0.545068 0.081485
C  -11.604084 0.545056 0.081262
C  12.105059 -1.867872 -0.488791
C  -12.105064 1.867839 -0.489067
H  0.854106 -2.352896 -0.467504
H  -1.605112 -1.924629 -0.482746
H  1.60511 1.924598 -0.482802
H  -0.854108 2.352866 -0.467617
H  3.291665 1.202835 0.426438
H  -3.291684 -1.202831 0.426426
H  5.444536 -1.644314 -0.724255
H  -5.444535 1.644276 -0.72441
H  5.17835 2.336427 1.017374
H  -5.178377 -2.3364 1.017372
H  7.953401 -1.530201 -0.543958
H  -7.953403 1.53017 -0.544152
H  7.681987 2.423041 1.195391
H  -7.682018 -2.423008 1.195347
H  11.886362 -0.404578 1.14072
H  11.968721 0.328872 -0.488302
H  -11.886395 0.404599 1.140496
H  -11.968722 -0.328904 -0.488503
H  13.20913 -1.898516 -0.446538
H  11.711898 -2.721322 0.089731
H  11.794698 -1.986878 -1.541007
H  -13.209135 1.898483 -0.446835
H  -11.711916 2.721309 0.089436
H  -11.794682 1.986812 -1.54128
