program: Gaussian 09
title: 000272160
version: EM64L-G09RevD.01
frameworkgroup: C1[X(C14H13NO2)]
method: RPBEPBE
basis: SDD
operation: Freq
keyword: #p
keyword: freq=noraman
keyword: PBEPBE/SDD
title: #p freq=noraman PBEPBE/SDD
converged: YES YES NO NO
title: Mulliken charges:
elementType: O O N C C C C C C C C C C C C C C H H H H H H H H H H H H H
charge: -0.325184 -0.259405 -0.389369 -0.487823 0.471977 0.244710 0.278943 -0.328401 -0.363171 -0.393145 -0.328932 -0.241957 -0.231299 -0.220547 -0.223814 -0.230445 -0.078983 0.207604 0.231519 0.230336 0.238974 0.235216 0.305922 0.227304 0.228742 0.231283 0.230401 0.233345 0.338585 0.167611
chargesum: 0.00000
title: Mulliken charges with hydrogens summed into heavy atoms:
elementType: O O N C C C C C C C C C C C C C C
charge: -0.325184 -0.259405 -0.050784 -0.048700 0.471977 0.244710 0.278943 -0.098065 -0.124197 -0.157929 -0.023010 -0.014653 -0.002556 0.010736 0.006587 0.002900 0.088628
polarizability: 1.63310361e+02 -1.91688899e+01 1.80660395e+02 1.84101228e+01 -7.50147465e+00 1.35565198e+02
1716.lowfreq: -10.0171 -6.7438 -0.0004 0.0004 0.0006 3.4764 7.9655 17.4574 35.8099
frequency: -6.5172 17.2301 35.7527 82.6893 108.1985 133.0378 171.2477 189.3693 232.0480 267.0489 328.1157 352.4360 375.5181 401.9215 441.8327 460.6910 485.0185 504.7488 554.0050 567.4323 592.2562 617.3192 700.9931 703.9781 732.7320 752.6914 758.6997 762.4000 787.8756 812.2587 838.9199 853.7975 862.4823 905.2058 931.4251 941.4307 951.1299 969.6452 978.2010 988.6401 990.2198 999.9397 1026.5845 1035.3687 1079.4942 1092.4078 1122.7956 1169.2290 1170.9889 1175.1711 1189.7024 1218.7453 1227.4493 1242.7399 1298.4108 1328.6584 1344.2979 1369.2121 1385.5197 1391.4730 1437.2796 1441.6907 1461.3641 1474.1679 1484.8062 1511.6545 1594.6559 1597.4726 1607.3278 1613.6014 1632.3793 2933.2847 3023.1639 3097.3681 3118.3155 3127.2843 3132.7510 3137.9912 3146.0426 3150.4703 3164.5597 3166.7236 3190.4412 3475.1751
redmass: 5.7966 4.7221 4.2902 6.5396 4.5258 4.5256 4.0939 5.8934 3.8858 9.1588 3.6823 2.5733 3.2300 2.7896 4.0137 4.9717 4.4150 4.2991 4.7275 4.7050 4.0311 6.2778 2.7611 2.4188 2.2925 2.0945 1.7016 1.2555 4.6355 3.3564 6.4352 1.2487 1.4114 4.5206 1.6708 1.4059 1.5481 1.7425 1.3969 1.3032 6.1191 1.3266 2.2196 2.1268 3.4738 1.5133 2.1477 1.8627 1.0677 1.0622 1.1189 2.8107 1.2111 1.6790 1.7729 1.2661 1.2790 1.9654 8.2068 2.1585 2.4592 2.1858 2.3845 1.1513 2.1499 2.6315 6.0532 5.5131 6.7054 6.0961 5.4207 1.0860 1.0605 1.1049 1.0878 1.0864 1.0855 1.0914 1.0912 1.0961 1.0981 1.1016 1.0960 1.0765
irintensity: 0.3813 0.1610 0.3329 5.2434 0.1286 4.5367 12.5126 9.4945 12.7628 1.4481 1.0868 3.3290 4.6653 0.0052 9.2190 1.5746 7.9397 15.6782 2.1492 2.6082 19.2560 0.2830 32.2081 25.9690 3.6468 53.6250 18.0704 173.6308 5.1053 16.7473 8.1343 0.3201 8.3763 108.2208 5.2243 10.0359 2.1595 2.7408 0.1395 3.4747 0.2945 0.0355 3.2148 16.6381 42.3136 6.5867 28.6467 40.7633 1.6891 0.9847 0.6562 16.5307 22.7612 54.9637 16.1923 0.5852 6.2306 3.6535 0.6815 47.5941 158.1368 17.2125 25.6655 20.0580 6.4814 262.1926 0.8868 17.5458 97.2606 0.5471 202.7225 108.2373 45.7511 13.5051 7.0353 2.3227 2.5180 11.1795 21.4680 33.1570 19.3739 17.2002 5.4494 61.0027
temp: 298.150 k
press: 1.00000 atm
elementType: 8 8 7 6 6 6 6 6 6 6 6 6 6 6 6 6 6 1 1 1 1 1 1 1 1 1 1 1 1 1
symmnumber: 1
zpe: 620436.0 jmol-1
zpe.correction: 0.236312 hartree
zpe.thermalcorrener: 0.249983 hartree
zpe.thermalcorrenthalpy: 0.250927 hartree
zpe.thermalcorrgfe: 0.194171 hartree
zpe.sumelectzpe: -745.281677 hartree
zpe.sumelectthermal: -745.268006 hartree
zpe.sumelectthermalent: -745.267062 hartree
zpe.sumelectthermalfe: -745.323817 hartree
dipole: -4.4042 -2.5580 -1.0310
dipole: 5.1965
quadrupole: -104.3043 -96.5647 -94.2993
quadrupole: -14.2533 0.5928 -6.7845
quadrupole: -5.9148 1.8247 4.0901 -14.2533 0.5928 -6.7845
hfenergy: -745.5179888 hartree
pointgroup: C01 [X(C14H13N1O2)]
dipole: -1.6909449 1.1122676 -0.2887106 debye
polarizability: 166.3651909|7.337387|160.4329129|-25.8905274|-22.565648|152.7378496 unknown
InChI: InChI=1S/C14H13NO2/c16-11-15-13-8-4-5-9-14(13)17-10-12-6-2-1-3-7-12/h1-9,11,15H,10H2
charge 0 multiplicity 1
30 atoms
O  0.060877 1.402813 1.16836
O  2.644451 -2.863119 1.421474
N  1.240677 -0.962438 1.489802
C  -1.236947 1.944278 0.644727
C  -2.113001 0.840877 0.092701
C  1.074507 1.088887 0.225352
C  1.734758 -0.159863 0.430841
C  1.489825 1.960665 -0.799232
C  -2.073031 0.503401 -1.284474
C  -2.960662 0.10208 0.958368
C  2.819828 -0.521081 -0.407731
C  2.56677 1.590743 -1.638085
C  3.224442 0.35556 -1.438348
C  -2.858203 -0.559392 -1.784838
C  -3.748939 -0.95829 0.460225
C  -3.697243 -1.292302 -0.913929
C  1.68482 -2.204767 1.911367
H  -1.029952 2.721193 -0.112818
H  -1.683162 2.417814 1.534103
H  0.99898 2.930891 -0.931064
H  -1.42253 1.067808 -1.963136
H  -3.003236 0.362362 2.023645
H  3.319423 -1.477514 -0.241187
H  2.893862 2.27063 -2.431825
H  4.061569 0.070888 -2.084524
H  -2.817219 -0.814299 -2.849476
H  -4.40358 -1.519451 1.136202
H  -4.308025 -2.114708 -1.302601
H  0.446039 -0.53994 1.984612
H  1.0781 -2.578224 2.768286
